{"text_format":"1","workbook":"xlsx","n_sheets":6,"sheets":["ID","Info","Data","Kwitansi-1","Kwitansi-2","HD"],"not_rendered":{"charts":0,"images":3,"macros":1,"external_links":0,"defined_names":88,"comments":0,"pivot_tables":0},"unopened":[],"bounds":{"document_bytes":16777216,"sheet_cells":100000,"rows_first":2000,"rows_last":500,"rows_between":2000,"halvings":0,"cell_chars":16384,"cell_head_chars":4096},"cells_cut":0,"cells_raw":0,"read":"whole","date_system":"1900"}

{"sheet":"ID","index":0,"n_rows":248,"n_cols":501,"rows_kept":248,"cut":false,"hidden":true,"merged":[[114,277,115,280],[114,1,115,1],[114,2,115,5],[114,56,115,56],[114,57,115,60],[114,111,115,111],[114,112,115,115],[114,166,115,166],[114,167,115,170],[114,221,115,221],[114,222,115,225],[114,276,115,276],[114,496,115,496],[114,497,115,500],[114,331,115,331],[114,332,115,335],[114,386,115,386],[114,387,115,390],[114,441,115,441],[114,442,115,445],[2,441,3,441],[2,442,3,445],[2,496,3,496],[2,497,3,500],[2,276,3,276],[2,277,3,280],[2,331,3,331],[2,332,3,335],[2,386,3,386],[2,387,3,390],[2,1,3,1],[2,2,3,5],[2,56,3,56],[2,57,3,60],[2,222,3,225],[2,111,3,111],[2,112,3,115],[2,166,3,166],[2,167,3,170],[2,221,3,221]]}
[]
[null,"Nilai",{"$f":"IF(AND(B2002=0,B4002=0),Kwitansi_01,\"#\")","v":5000000},null,null,null,null,null,null,null,null,null,null,null,null,null,null,null,null,null,null,null,null,null,null,null,null,null,null,null,null,null,null,null,null,null,null,null,null,null,null,null,null,null,null,null,null,null,null,null,null,null,null,null,null,null,"Nilai",{"$f":"IF(AND(B2002=0,B4002=0),Kwitansi_02,\"#\")","v":5000000},null,null,null,null,null,null,null,null,null,null,null,null,null,null,null,null,null,null,null,null,null,null,null,null,null,null,null,null,null,null,null,null,null,null,null,null,null,null,null,null,null,null,null,null,null,null,null,null,null,null,null,null,null,"Nilai",{"$f":"IF(AND(B2002=0,B4002=0),Kwitansi_03,\"#\")","v":5000000},null,null,null,null,null,null,null,null,null,null,null,null,null,null,null,null,null,null,null,null,null,null,null,null,null,null,null,null,null,null,null,null,null,null,null,null,null,null,null,null,null,null,null,null,null,null,null,null,null,null,null,null,null,"Nilai",{"$f":"IF(AND(B2002=0,B4002=0),Kwitansi_04,\"#\")","v":5000000},null,null,null,null,null,null,null,null,null,null,null,null,null,null,null,null,null,null,null,null,null,null,null,null,null,null,null,null,null,null,null,null,null,null,null,null,null,null,null,null,null,null,null,null,null,null,null,null,null,null,null,null,null,"Nilai",{"$f":"IF(AND(B2002=0,B4002=0),Kwitansi_05,\"#\")","v":5000000},null,null,null,null,null,null,null,null,null,null,null,null,null,null,null,null,null,null,null,null,null,null,null,null,null,null,null,null,null,null,null,null,null,null,null,null,null,null,null,null,null,null,null,null,null,null,null,null,null,null,null,null,null,"Nilai",{"$f":"IF(AND(B2002=0,B4002=0),Kwitansi_06,\"#\")","v":5000000},null,null,null,null,null,null,null,null,null,null,null,null,null,null,null,null,null,null,null,null,null,null,null,null,null,null,null,null,null,null,null,null,null,null,null,null,null,null,null,null,null,null,null,null,null,null,null,null,null,null,null,null,null,"Nilai",{"$f":"IF(AND(B2002=0,B4002=0),Kwitansi_07,\"#\")","v":5000000},null,null,null,null,null,null,null,null,null,null,null,null,null,null,null,null,null,null,null,null,null,null,null,null,null,null,null,null,null,null,null,null,null,null,null,null,null,null,null,null,null,null,null,null,null,null,null,null,null,null,null,null,null,"Nilai",{"$f":"IF(AND(B2002=0,B4002=0),Kwitansi_08,\"#\")","v":5000000},null,null,null,null,null,null,null,null,null,null,null,null,null,null,null,null,null,null,null,null,null,null,null,null,null,null,null,null,null,null,null,null,null,null,null,null,null,null,null,null,null,null,null,null,null,null,null,null,null,null,null,null,null,"Nilai",{"$f":"IF(AND(B2002=0,B4002=0),Kwitansi_09,\"#\")","v":6000000},null,null,null,null,null,null,null,null,null,null,null,null,null,null,null,null,null,null,null,null,null,null,null,null,null,null,null,null,null,null,null,null,null,null,null,null,null,null,null,null,null,null,null,null,null,null,null,null,null,null,null,null,null,"Nilai",{"$f":"IF(AND(B2002=0,B4002=0),Kwitansi_10,\"#\")","v":9000000}]
[null,"Terbilang",{"$f":"TRIM(C13&\" \"&D13&\" \"&E13&\" \"&F13)","v":"lima juta"},null,null,null,null,null,null,null,null,null,null,null,null,null,null,null,null,null,null,null,null,null,null,null,null,null,null,null,null,null,null,null,null,null,null,null,null,null,null,null,null,null,null,null,null,null,null,null,null,null,null,null,null,null,"Terbilang",{"$f":"TRIM(BF13&\" \"&BG13&\" \"&BH13&\" \"&BI13)","v":"lima juta"},null,null,null,null,null,null,null,null,null,null,null,null,null,null,null,null,null,null,null,null,null,null,null,null,null,null,null,null,null,null,null,null,null,null,null,null,null,null,null,null,null,null,null,null,null,null,null,null,null,null,null,null,null,"Terbilang",{"$f":"TRIM(DI13&\" \"&DJ13&\" \"&DK13&\" \"&DL13)","v":"lima juta"},null,null,null,null,null,null,null,null,null,null,null,null,null,null,null,null,null,null,null,null,null,null,null,null,null,null,null,null,null,null,null,null,null,null,null,null,null,null,null,null,null,null,null,null,null,null,null,null,null,null,null,null,null,"Terbilang",{"$f":"TRIM(FL13&\" \"&FM13&\" \"&FN13&\" \"&FO13)","v":"lima juta"},null,null,null,null,null,null,null,null,null,null,null,null,null,null,null,null,null,null,null,null,null,null,null,null,null,null,null,null,null,null,null,null,null,null,null,null,null,null,null,null,null,null,null,null,null,null,null,null,null,null,null,null,null,"Terbilang",{"$f":"TRIM(HO13&\" \"&HP13&\" \"&HQ13&\" \"&HR13)","v":"lima juta"},null,null,null,null,null,null,null,null,null,null,null,null,null,null,null,null,null,null,null,null,null,null,null,null,null,null,null,null,null,null,null,null,null,null,null,null,null,null,null,null,null,null,null,null,null,null,null,null,null,null,null,null,null,"Terbilang",{"$f":"TRIM(JR13&\" \"&JS13&\" \"&JT13&\" \"&JU13)","v":"lima juta"},null,null,null,null,null,null,null,null,null,null,null,null,null,null,null,null,null,null,null,null,null,null,null,null,null,null,null,null,null,null,null,null,null,null,null,null,null,null,null,null,null,null,null,null,null,null,null,null,null,null,null,null,null,"Terbilang",{"$f":"TRIM(LU13&\" \"&LV13&\" \"&LW13&\" \"&LX13)","v":"lima juta"},null,null,null,null,null,null,null,null,null,null,null,null,null,null,null,null,null,null,null,null,null,null,null,null,null,null,null,null,null,null,null,null,null,null,null,null,null,null,null,null,null,null,null,null,null,null,null,null,null,null,null,null,null,"Terbilang",{"$f":"TRIM(NX13&\" \"&NY13&\" \"&NZ13&\" \"&OA13)","v":"lima juta"},null,null,null,null,null,null,null,null,null,null,null,null,null,null,null,null,null,null,null,null,null,null,null,null,null,null,null,null,null,null,null,null,null,null,null,null,null,null,null,null,null,null,null,null,null,null,null,null,null,null,null,null,null,"Terbilang",{"$f":"TRIM(QA13&\" \"&QB13&\" \"&QC13&\" \"&QD13)","v":"enam juta"},null,null,null,null,null,null,null,null,null,null,null,null,null,null,null,null,null,null,null,null,null,null,null,null,null,null,null,null,null,null,null,null,null,null,null,null,null,null,null,null,null,null,null,null,null,null,null,null,null,null,null,null,null,"Terbilang",{"$f":"TRIM(SD13&\" \"&SE13&\" \"&SF13&\" \"&SG13)","v":"sembilan juta"}]
[]
[null," ","Milyar","Jutaan","Ratusan Ribu\ns.d. Ribuan","Ratusan \ns.d. Satuan",null,null,null,null,null,null,null,null,null,null,null,null,null,null,null,null,null,null,null,null,null,null,null,null,null,null,null,null,null,null,null,null,null,null,null,null,null,null,null,null,null,null,null,null,null,null,null,null,null,null," ","Milyar","Jutaan","Ratusan Ribu\ns.d. Ribuan","Ratusan \ns.d. Satuan",null,null,null,null,null,null,null,null,null,null,null,null,null,null,null,null,null,null,null,null,null,null,null,null,null,null,null,null,null,null,null,null,null,null,null,null,null,null,null,null,null,null,null,null,null,null,null,null,null,null," ","Milyar","Jutaan","Ratusan Ribu\ns.d. Ribuan","Ratusan \ns.d. Satuan",null,null,null,null,null,null,null,null,null,null,null,null,null,null,null,null,null,null,null,null,null,null,null,null,null,null,null,null,null,null,null,null,null,null,null,null,null,null,null,null,null,null,null,null,null,null,null,null,null,null," ","Milyar","Jutaan","Ratusan Ribu\ns.d. Ribuan","Ratusan \ns.d. Satuan",null,null,null,null,null,null,null,null,null,null,null,null,null,null,null,null,null,null,null,null,null,null,null,null,null,null,null,null,null,null,null,null,null,null,null,null,null,null,null,null,null,null,null,null,null,null,null,null,null,null," ","Milyar","Jutaan","Ratusan Ribu\ns.d. Ribuan","Ratusan \ns.d. Satuan",null,null,null,null,null,null,null,null,null,null,null,null,null,null,null,null,null,null,null,null,null,null,null,null,null,null,null,null,null,null,null,null,null,null,null,null,null,null,null,null,null,null,null,null,null,null,null,null,null,null," ","Milyar","Jutaan","Ratusan Ribu\ns.d. Ribuan","Ratusan \ns.d. Satuan",null,null,null,null,null,null,null,null,null,null,null,null,null,null,null,null,null,null,null,null,null,null,null,null,null,null,null,null,null,null,null,null,null,null,null,null,null,null,null,null,null,null,null,null,null,null,null,null,null,null," ","Milyar","Jutaan","Ratusan Ribu\ns.d. Ribuan","Ratusan \ns.d. Satuan",null,null,null,null,null,null,null,null,null,null,null,null,null,null,null,null,null,null,null,null,null,null,null,null,null,null,null,null,null,null,null,null,null,null,null,null,null,null,null,null,null,null,null,null,null,null,null,null,null,null," ","Milyar","Jutaan","Ratusan Ribu\ns.d. Ribuan","Ratusan \ns.d. Satuan",null,null,null,null,null,null,null,null,null,null,null,null,null,null,null,null,null,null,null,null,null,null,null,null,null,null,null,null,null,null,null,null,null,null,null,null,null,null,null,null,null,null,null,null,null,null,null,null,null,null," ","Milyar","Jutaan","Ratusan Ribu\ns.d. Ribuan","Ratusan \ns.d. Satuan",null,null,null,null,null,null,null,null,null,null,null,null,null,null,null,null,null,null,null,null,null,null,null,null,null,null,null,null,null,null,null,null,null,null,null,null,null,null,null,null,null,null,null,null,null,null,null,null,null,null," ","Milyar","Jutaan","Ratusan Ribu\ns.d. Ribuan","Ratusan \ns.d. Satuan"]
[null,"Posisi",1,4,7,10,null,null,null,null,null,null,null,null,null,null,null,null,null,null,null,null,null,null,null,null,null,null,null,null,null,null,null,null,null,null,null,null,null,null,null,null,null,null,null,null,null,null,null,null,null,null,null,null,null,null,"Posisi",1,4,7,10,null,null,null,null,null,null,null,null,null,null,null,null,null,null,null,null,null,null,null,null,null,null,null,null,null,null,null,null,null,null,null,null,null,null,null,null,null,null,null,null,null,null,null,null,null,null,null,null,null,null,"Posisi",1,4,7,10,null,null,null,null,null,null,null,null,null,null,null,null,null,null,null,null,null,null,null,null,null,null,null,null,null,null,null,null,null,null,null,null,null,null,null,null,null,null,null,null,null,null,null,null,null,null,null,null,null,null,"Posisi",1,4,7,10,null,null,null,null,null,null,null,null,null,null,null,null,null,null,null,null,null,null,null,null,null,null,null,null,null,null,null,null,null,null,null,null,null,null,null,null,null,null,null,null,null,null,null,null,null,null,null,null,null,null,"Posisi",1,4,7,10,null,null,null,null,null,null,null,null,null,null,null,null,null,null,null,null,null,null,null,null,null,null,null,null,null,null,null,null,null,null,null,null,null,null,null,null,null,null,null,null,null,null,null,null,null,null,null,null,null,null,"Posisi",1,4,7,10,null,null,null,null,null,null,null,null,null,null,null,null,null,null,null,null,null,null,null,null,null,null,null,null,null,null,null,null,null,null,null,null,null,null,null,null,null,null,null,null,null,null,null,null,null,null,null,null,null,null,"Posisi",1,4,7,10,null,null,null,null,null,null,null,null,null,null,null,null,null,null,null,null,null,null,null,null,null,null,null,null,null,null,null,null,null,null,null,null,null,null,null,null,null,null,null,null,null,null,null,null,null,null,null,null,null,null,"Posisi",1,4,7,10,null,null,null,null,null,null,null,null,null,null,null,null,null,null,null,null,null,null,null,null,null,null,null,null,null,null,null,null,null,null,null,null,null,null,null,null,null,null,null,null,null,null,null,null,null,null,null,null,null,null,"Posisi",1,4,7,10,null,null,null,null,null,null,null,null,null,null,null,null,null,null,null,null,null,null,null,null,null,null,null,null,null,null,null,null,null,null,null,null,null,null,null,null,null,null,null,null,null,null,null,null,null,null,null,null,null,null,"Posisi",1,4,7,10]
[null,"Digit",3,3,3,3,null,null,null,null,null,null,null,null,null,null,null,null,null,null,null,null,null,null,null,null,null,null,null,null,null,null,null,null,null,null,null,null,null,null,null,null,null,null,null,null,null,null,null,null,null,null,null,null,null,null,"Digit",3,3,3,3,null,null,null,null,null,null,null,null,null,null,null,null,null,null,null,null,null,null,null,null,null,null,null,null,null,null,null,null,null,null,null,null,null,null,null,null,null,null,null,null,null,null,null,null,null,null,null,null,null,null,"Digit",3,3,3,3,null,null,null,null,null,null,null,null,null,null,null,null,null,null,null,null,null,null,null,null,null,null,null,null,null,null,null,null,null,null,null,null,null,null,null,null,null,null,null,null,null,null,null,null,null,null,null,null,null,null,"Digit",3,3,3,3,null,null,null,null,null,null,null,null,null,null,null,null,null,null,null,null,null,null,null,null,null,null,null,null,null,null,null,null,null,null,null,null,null,null,null,null,null,null,null,null,null,null,null,null,null,null,null,null,null,null,"Digit",3,3,3,3,null,null,null,null,null,null,null,null,null,null,null,null,null,null,null,null,null,null,null,null,null,null,null,null,null,null,null,null,null,null,null,null,null,null,null,null,null,null,null,null,null,null,null,null,null,null,null,null,null,null,"Digit",3,3,3,3,null,null,null,null,null,null,null,null,null,null,null,null,null,null,null,null,null,null,null,null,null,null,null,null,null,null,null,null,null,null,null,null,null,null,null,null,null,null,null,null,null,null,null,null,null,null,null,null,null,null,"Digit",3,3,3,3,null,null,null,null,null,null,null,null,null,null,null,null,null,null,null,null,null,null,null,null,null,null,null,null,null,null,null,null,null,null,null,null,null,null,null,null,null,null,null,null,null,null,null,null,null,null,null,null,null,null,"Digit",3,3,3,3,null,null,null,null,null,null,null,null,null,null,null,null,null,null,null,null,null,null,null,null,null,null,null,null,null,null,null,null,null,null,null,null,null,null,null,null,null,null,null,null,null,null,null,null,null,null,null,null,null,null,"Digit",3,3,3,3,null,null,null,null,null,null,null,null,null,null,null,null,null,null,null,null,null,null,null,null,null,null,null,null,null,null,null,null,null,null,null,null,null,null,null,null,null,null,null,null,null,null,null,null,null,null,null,null,null,null,"Digit",3,3,3,3]
[null,"NILAI",{"$f":"--MID(TEXT(TRUNC(N($C$2),0),REPT(0,12)),C6,C7)","v":0},{"$f":"--MID(TEXT(TRUNC(N($C$2),0),REPT(0,12)),D6,D7)","v":5},0,{"$f":"--MID(TEXT(TRUNC(N($C$2),0),REPT(0,12)),F6,F7)","v":0},null,null,null,null,null,null,null,null,null,null,null,null,null,null,null,null,null,null,null,null,null,null,null,null,null,null,null,null,null,null,null,null,null,null,null,null,null,null,null,null,null,null,null,null,null,null,null,null,null,null,"NILAI",{"$f":"--MID(TEXT(TRUNC(N($BF$2),0),REPT(0,12)),BF6,BF7)","v":0},{"$f":"--MID(TEXT(TRUNC(N($BF$2),0),REPT(0,12)),BG6,BG7)","v":5},{"$f":"--MID(TEXT(TRUNC(N($BF$2),0),REPT(0,12)),BH6,BH7)","v":0},{"$f":"--MID(TEXT(TRUNC(N($BF$2),0),REPT(0,12)),BI6,BI7)","v":0},null,null,null,null,null,null,null,null,null,null,null,null,null,null,null,null,null,null,null,null,null,null,null,null,null,null,null,null,null,null,null,null,null,null,null,null,null,null,null,null,null,null,null,null,null,null,null,null,null,null,"NILAI",{"$f":"--MID(TEXT(TRUNC(N($DI$2),0),REPT(0,12)),DI6,DI7)","v":0},{"$f":"--MID(TEXT(TRUNC(N($DI$2),0),REPT(0,12)),DJ6,DJ7)","v":5},{"$f":"--MID(TEXT(TRUNC(N($DI$2),0),REPT(0,12)),DK6,DK7)","v":0},{"$f":"--MID(TEXT(TRUNC(N($DI$2),0),REPT(0,12)),DL6,DL7)","v":0},null,null,null,null,null,null,null,null,null,null,null,null,null,null,null,null,null,null,null,null,null,null,null,null,null,null,null,null,null,null,null,null,null,null,null,null,null,null,null,null,null,null,null,null,null,null,null,null,null,null,"NILAI",{"$f":"--MID(TEXT(TRUNC(N($FL$2),0),REPT(0,12)),FL6,FL7)","v":0},{"$f":"--MID(TEXT(TRUNC(N($FL$2),0),REPT(0,12)),FM6,FM7)","v":5},{"$f":"--MID(TEXT(TRUNC(N($FL$2),0),REPT(0,12)),FN6,FN7)","v":0},{"$f":"--MID(TEXT(TRUNC(N($FL$2),0),REPT(0,12)),FO6,FO7)","v":0},null,null,null,null,null,null,null,null,null,null,null,null,null,null,null,null,null,null,null,null,null,null,null,null,null,null,null,null,null,null,null,null,null,null,null,null,null,null,null,null,null,null,null,null,null,null,null,null,null,null,"NILAI",{"$f":"--MID(TEXT(TRUNC(N($HO$2),0),REPT(0,12)),HO6,HO7)","v":0},{"$f":"--MID(TEXT(TRUNC(N($HO$2),0),REPT(0,12)),HP6,HP7)","v":5},{"$f":"--MID(TEXT(TRUNC(N($HO$2),0),REPT(0,12)),HQ6,HQ7)","v":0},{"$f":"--MID(TEXT(TRUNC(N($HO$2),0),REPT(0,12)),HR6,HR7)","v":0},null,null,null,null,null,null,null,null,null,null,null,null,null,null,null,null,null,null,null,null,null,null,null,null,null,null,null,null,null,null,null,null,null,null,null,null,null,null,null,null,null,null,null,null,null,null,null,null,null,null,"NILAI",{"$f":"--MID(TEXT(TRUNC(N($JR$2),0),REPT(0,12)),JR6,JR7)","v":0},{"$f":"--MID(TEXT(TRUNC(N($JR$2),0),REPT(0,12)),JS6,JS7)","v":5},{"$f":"--MID(TEXT(TRUNC(N($JR$2),0),REPT(0,12)),JT6,JT7)","v":0},{"$f":"--MID(TEXT(TRUNC(N($JR$2),0),REPT(0,12)),JU6,JU7)","v":0},null,null,null,null,null,null,null,null,null,null,null,null,null,null,null,null,null,null,null,null,null,null,null,null,null,null,null,null,null,null,null,null,null,null,null,null,null,null,null,null,null,null,null,null,null,null,null,null,null,null,"NILAI",{"$f":"--MID(TEXT(TRUNC(N($LU$2),0),REPT(0,12)),LU6,LU7)","v":0},{"$f":"--MID(TEXT(TRUNC(N($LU$2),0),REPT(0,12)),LV6,LV7)","v":5},{"$f":"--MID(TEXT(TRUNC(N($LU$2),0),REPT(0,12)),LW6,LW7)","v":0},{"$f":"--MID(TEXT(TRUNC(N($LU$2),0),REPT(0,12)),LX6,LX7)","v":0},null,null,null,null,null,null,null,null,null,null,null,null,null,null,null,null,null,null,null,null,null,null,null,null,null,null,null,null,null,null,null,null,null,null,null,null,null,null,null,null,null,null,null,null,null,null,null,null,null,null,"NILAI",{"$f":"--MID(TEXT(TRUNC(N($NX$2),0),REPT(0,12)),NX6,NX7)","v":0},{"$f":"--MID(TEXT(TRUNC(N($NX$2),0),REPT(0,12)),NY6,NY7)","v":5},{"$f":"--MID(TEXT(TRUNC(N($NX$2),0),REPT(0,12)),NZ6,NZ7)","v":0},{"$f":"--MID(TEXT(TRUNC(N($NX$2),0),REPT(0,12)),OA6,OA7)","v":0},null,null,null,null,null,null,null,null,null,null,null,null,null,null,null,null,null,null,null,null,null,null,null,null,null,null,null,null,null,null,null,null,null,null,null,null,null,null,null,null,null,null,null,null,null,null,null,null,null,null,"NILAI",{"$f":"--MID(TEXT(TRUNC(N($QA$2),0),REPT(0,12)),QA6,QA7)","v":0},{"$f":"--MID(TEXT(TRUNC(N($QA$2),0),REPT(0,12)),QB6,QB7)","v":6},{"$f":"--MID(TEXT(TRUNC(N($QA$2),0),REPT(0,12)),QC6,QC7)","v":0},{"$f":"--MID(TEXT(TRUNC(N($QA$2),0),REPT(0,12)),QD6,QD7)","v":0},null,null,null,null,null,null,null,null,null,null,null,null,null,null,null,null,null,null,null,null,null,null,null,null,null,null,null,null,null,null,null,null,null,null,null,null,null,null,null,null,null,null,null,null,null,null,null,null,null,null,"NILAI",{"$f":"--MID(TEXT(TRUNC(N($SD$2),0),REPT(0,12)),SD6,SD7)","v":0},{"$f":"--MID(TEXT(TRUNC(N($SD$2),0),REPT(0,12)),SE6,SE7)","v":9},{"$f":"--MID(TEXT(TRUNC(N($SD$2),0),REPT(0,12)),SF6,SF7)","v":0},{"$f":"--MID(TEXT(TRUNC(N($SD$2),0),REPT(0,12)),SG6,SG7)","v":0}]
[null,"Ratusan",{"$f":"N(\"Ambil angka Milyar\")+--MID(TEXT(N(C$8),REPT(0,3)),1,1)","v":0},{"$f":"--MID(TEXT(N(D$8),REPT(0,3)),1,1)","v":0},{"$f":"--MID(TEXT(N(E$8),REPT(0,3)),1,1)","v":0},{"$f":"--MID(TEXT(N(F$8),REPT(0,3)),1,1)","v":0},null,null,null,null,null,null,null,null,null,null,null,null,null,null,null,null,null,null,null,null,null,null,null,null,null,null,null,null,null,null,null,null,null,null,null,null,null,null,null,null,null,null,null,null,null,null,null,null,null,null,"Ratusan",{"$f":"N(\"Ambil angka Milyar\")+--MID(TEXT(N(BF$8),REPT(0,3)),1,1)","v":0},{"$f":"--MID(TEXT(N(BG$8),REPT(0,3)),1,1)","v":0},{"$f":"--MID(TEXT(N(BH$8),REPT(0,3)),1,1)","v":0},{"$f":"--MID(TEXT(N(BI$8),REPT(0,3)),1,1)","v":0},null,null,null,null,null,null,null,null,null,null,null,null,null,null,null,null,null,null,null,null,null,null,null,null,null,null,null,null,null,null,null,null,null,null,null,null,null,null,null,null,null,null,null,null,null,null,null,null,null,null,"Ratusan",{"$f":"N(\"Ambil angka Milyar\")+--MID(TEXT(N(DI$8),REPT(0,3)),1,1)","v":0},{"$f":"--MID(TEXT(N(DJ$8),REPT(0,3)),1,1)","v":0},{"$f":"--MID(TEXT(N(DK$8),REPT(0,3)),1,1)","v":0},{"$f":"--MID(TEXT(N(DL$8),REPT(0,3)),1,1)","v":0},null,null,null,null,null,null,null,null,null,null,null,null,null,null,null,null,null,null,null,null,null,null,null,null,null,null,null,null,null,null,null,null,null,null,null,null,null,null,null,null,null,null,null,null,null,null,null,null,null,null,"Ratusan",{"$f":"N(\"Ambil angka Milyar\")+--MID(TEXT(N(FL$8),REPT(0,3)),1,1)","v":0},{"$f":"--MID(TEXT(N(FM$8),REPT(0,3)),1,1)","v":0},{"$f":"--MID(TEXT(N(FN$8),REPT(0,3)),1,1)","v":0},{"$f":"--MID(TEXT(N(FO$8),REPT(0,3)),1,1)","v":0},null,null,null,null,null,null,null,null,null,null,null,null,null,null,null,null,null,null,null,null,null,null,null,null,null,null,null,null,null,null,null,null,null,null,null,null,null,null,null,null,null,null,null,null,null,null,null,null,null,null,"Ratusan",{"$f":"N(\"Ambil angka Milyar\")+--MID(TEXT(N(HO$8),REPT(0,3)),1,1)","v":0},{"$f":"--MID(TEXT(N(HP$8),REPT(0,3)),1,1)","v":0},{"$f":"--MID(TEXT(N(HQ$8),REPT(0,3)),1,1)","v":0},{"$f":"--MID(TEXT(N(HR$8),REPT(0,3)),1,1)","v":0},null,null,null,null,null,null,null,null,null,null,null,null,null,null,null,null,null,null,null,null,null,null,null,null,null,null,null,null,null,null,null,null,null,null,null,null,null,null,null,null,null,null,null,null,null,null,null,null,null,null,"Ratusan",{"$f":"N(\"Ambil angka Milyar\")+--MID(TEXT(N(JR$8),REPT(0,3)),1,1)","v":0},{"$f":"--MID(TEXT(N(JS$8),REPT(0,3)),1,1)","v":0},{"$f":"--MID(TEXT(N(JT$8),REPT(0,3)),1,1)","v":0},{"$f":"--MID(TEXT(N(JU$8),REPT(0,3)),1,1)","v":0},null,null,null,null,null,null,null,null,null,null,null,null,null,null,null,null,null,null,null,null,null,null,null,null,null,null,null,null,null,null,null,null,null,null,null,null,null,null,null,null,null,null,null,null,null,null,null,null,null,null,"Ratusan",{"$f":"N(\"Ambil angka Milyar\")+--MID(TEXT(N(LU$8),REPT(0,3)),1,1)","v":0},{"$f":"--MID(TEXT(N(LV$8),REPT(0,3)),1,1)","v":0},{"$f":"--MID(TEXT(N(LW$8),REPT(0,3)),1,1)","v":0},{"$f":"--MID(TEXT(N(LX$8),REPT(0,3)),1,1)","v":0},null,null,null,null,null,null,null,null,null,null,null,null,null,null,null,null,null,null,null,null,null,null,null,null,null,null,null,null,null,null,null,null,null,null,null,null,null,null,null,null,null,null,null,null,null,null,null,null,null,null,"Ratusan",{"$f":"N(\"Ambil angka Milyar\")+--MID(TEXT(N(NX$8),REPT(0,3)),1,1)","v":0},{"$f":"--MID(TEXT(N(NY$8),REPT(0,3)),1,1)","v":0},{"$f":"--MID(TEXT(N(NZ$8),REPT(0,3)),1,1)","v":0},{"$f":"--MID(TEXT(N(OA$8),REPT(0,3)),1,1)","v":0},null,null,null,null,null,null,null,null,null,null,null,null,null,null,null,null,null,null,null,null,null,null,null,null,null,null,null,null,null,null,null,null,null,null,null,null,null,null,null,null,null,null,null,null,null,null,null,null,null,null,"Ratusan",{"$f":"N(\"Ambil angka Milyar\")+--MID(TEXT(N(QA$8),REPT(0,3)),1,1)","v":0},{"$f":"--MID(TEXT(N(QB$8),REPT(0,3)),1,1)","v":0},{"$f":"--MID(TEXT(N(QC$8),REPT(0,3)),1,1)","v":0},{"$f":"--MID(TEXT(N(QD$8),REPT(0,3)),1,1)","v":0},null,null,null,null,null,null,null,null,null,null,null,null,null,null,null,null,null,null,null,null,null,null,null,null,null,null,null,null,null,null,null,null,null,null,null,null,null,null,null,null,null,null,null,null,null,null,null,null,null,null,"Ratusan",{"$f":"N(\"Ambil angka Milyar\")+--MID(TEXT(N(SD$8),REPT(0,3)),1,1)","v":0},{"$f":"--MID(TEXT(N(SE$8),REPT(0,3)),1,1)","v":0},{"$f":"--MID(TEXT(N(SF$8),REPT(0,3)),1,1)","v":0},{"$f":"--MID(TEXT(N(SG$8),REPT(0,3)),1,1)","v":0}]
[null,"Puluhan",{"$f":"N(\"Bila digit pertama angka puluhan > 1 MAKA hasilkan 1 digit angka depannya BILA TIDAK hasilkan Nol\")+IF(--MID(TEXT(N(C$8),REPT(0,3)),2,1)>1,--MID(TEXT(N(C$8),REPT(0,3)),2,1),0)","v":0},{"$f":"N(\"Bila digit pertama angka puluhan > 1 MAKA hasilkan 1 digit angka depannya BILA TIDAK hasilkan Nol\")+IF(--MID(TEXT(N(D$8),REPT(0,3)),2,1)>1,--MID(TEXT(N(D$8),REPT(0,3)),2,1),0)","v":0},{"$f":"N(\"Bila digit pertama angka puluhan > 1 MAKA hasilkan 1 digit angka depannya BILA TIDAK hasilkan Nol\")+IF(--MID(TEXT(N(E$8),REPT(0,3)),2,1)>1,--MID(TEXT(N(E$8),REPT(0,3)),2,1),0)","v":0},{"$f":"N(\"Bila digit pertama angka puluhan > 1 MAKA hasilkan 1 digit angka depannya BILA TIDAK hasilkan Nol\")+IF(--MID(TEXT(N(F$8),REPT(0,3)),2,1)>1,--MID(TEXT(N(F$8),REPT(0,3)),2,1),0)","v":0},null,null,null,null,null,null,null,null,null,null,null,null,null,null,null,null,null,null,null,null,null,null,null,null,null,null,null,null,null,null,null,null,null,null,null,null,null,null,null,null,null,null,null,null,null,null,null,null,null,null,"Puluhan",{"$f":"N(\"Bila digit pertama angka puluhan > 1 MAKA hasilkan 1 digit angka depannya BILA TIDAK hasilkan Nol\")+IF(--MID(TEXT(N(BF$8),REPT(0,3)),2,1)>1,--MID(TEXT(N(BF$8),REPT(0,3)),2,1),0)","v":0},{"$f":"N(\"Bila digit pertama angka puluhan > 1 MAKA hasilkan 1 digit angka depannya BILA TIDAK hasilkan Nol\")+IF(--MID(TEXT(N(BG$8),REPT(0,3)),2,1)>1,--MID(TEXT(N(BG$8),REPT(0,3)),2,1),0)","v":0},{"$f":"N(\"Bila digit pertama angka puluhan > 1 MAKA hasilkan 1 digit angka depannya BILA TIDAK hasilkan Nol\")+IF(--MID(TEXT(N(BH$8),REPT(0,3)),2,1)>1,--MID(TEXT(N(BH$8),REPT(0,3)),2,1),0)","v":0},{"$f":"N(\"Bila digit pertama angka puluhan > 1 MAKA hasilkan 1 digit angka depannya BILA TIDAK hasilkan Nol\")+IF(--MID(TEXT(N(BI$8),REPT(0,3)),2,1)>1,--MID(TEXT(N(BI$8),REPT(0,3)),2,1),0)","v":0},null,null,null,null,null,null,null,null,null,null,null,null,null,null,null,null,null,null,null,null,null,null,null,null,null,null,null,null,null,null,null,null,null,null,null,null,null,null,null,null,null,null,null,null,null,null,null,null,null,null,"Puluhan",{"$f":"N(\"Bila digit pertama angka puluhan > 1 MAKA hasilkan 1 digit angka depannya BILA TIDAK hasilkan Nol\")+IF(--MID(TEXT(N(DI$8),REPT(0,3)),2,1)>1,--MID(TEXT(N(DI$8),REPT(0,3)),2,1),0)","v":0},{"$f":"N(\"Bila digit pertama angka puluhan > 1 MAKA hasilkan 1 digit angka depannya BILA TIDAK hasilkan Nol\")+IF(--MID(TEXT(N(DJ$8),REPT(0,3)),2,1)>1,--MID(TEXT(N(DJ$8),REPT(0,3)),2,1),0)","v":0},{"$f":"N(\"Bila digit pertama angka puluhan > 1 MAKA hasilkan 1 digit angka depannya BILA TIDAK hasilkan Nol\")+IF(--MID(TEXT(N(DK$8),REPT(0,3)),2,1)>1,--MID(TEXT(N(DK$8),REPT(0,3)),2,1),0)","v":0},{"$f":"N(\"Bila digit pertama angka puluhan > 1 MAKA hasilkan 1 digit angka depannya BILA TIDAK hasilkan Nol\")+IF(--MID(TEXT(N(DL$8),REPT(0,3)),2,1)>1,--MID(TEXT(N(DL$8),REPT(0,3)),2,1),0)","v":0},null,null,null,null,null,null,null,null,null,null,null,null,null,null,null,null,null,null,null,null,null,null,null,null,null,null,null,null,null,null,null,null,null,null,null,null,null,null,null,null,null,null,null,null,null,null,null,null,null,null,"Puluhan",{"$f":"N(\"Bila digit pertama angka puluhan > 1 MAKA hasilkan 1 digit angka depannya BILA TIDAK hasilkan Nol\")+IF(--MID(TEXT(N(FL$8),REPT(0,3)),2,1)>1,--MID(TEXT(N(FL$8),REPT(0,3)),2,1),0)","v":0},{"$f":"N(\"Bila digit pertama angka puluhan > 1 MAKA hasilkan 1 digit angka depannya BILA TIDAK hasilkan Nol\")+IF(--MID(TEXT(N(FM$8),REPT(0,3)),2,1)>1,--MID(TEXT(N(FM$8),REPT(0,3)),2,1),0)","v":0},{"$f":"N(\"Bila digit pertama angka puluhan > 1 MAKA hasilkan 1 digit angka depannya BILA TIDAK hasilkan Nol\")+IF(--MID(TEXT(N(FN$8),REPT(0,3)),2,1)>1,--MID(TEXT(N(FN$8),REPT(0,3)),2,1),0)","v":0},{"$f":"N(\"Bila digit pertama angka puluhan > 1 MAKA hasilkan 1 digit angka depannya BILA TIDAK hasilkan Nol\")+IF(--MID(TEXT(N(FO$8),REPT(0,3)),2,1)>1,--MID(TEXT(N(FO$8),REPT(0,3)),2,1),0)","v":0},null,null,null,null,null,null,null,null,null,null,null,null,null,null,null,null,null,null,null,null,null,null,null,null,null,null,null,null,null,null,null,null,null,null,null,null,null,null,null,null,null,null,null,null,null,null,null,null,null,null,"Puluhan",{"$f":"N(\"Bila digit pertama angka puluhan > 1 MAKA hasilkan 1 digit angka depannya BILA TIDAK hasilkan Nol\")+IF(--MID(TEXT(N(HO$8),REPT(0,3)),2,1)>1,--MID(TEXT(N(HO$8),REPT(0,3)),2,1),0)","v":0},{"$f":"N(\"Bila digit pertama angka puluhan > 1 MAKA hasilkan 1 digit angka depannya BILA TIDAK hasilkan Nol\")+IF(--MID(TEXT(N(HP$8),REPT(0,3)),2,1)>1,--MID(TEXT(N(HP$8),REPT(0,3)),2,1),0)","v":0},{"$f":"N(\"Bila digit pertama angka puluhan > 1 MAKA hasilkan 1 digit angka depannya BILA TIDAK hasilkan Nol\")+IF(--MID(TEXT(N(HQ$8),REPT(0,3)),2,1)>1,--MID(TEXT(N(HQ$8),REPT(0,3)),2,1),0)","v":0},{"$f":"N(\"Bila digit pertama angka puluhan > 1 MAKA hasilkan 1 digit angka depannya BILA TIDAK hasilkan Nol\")+IF(--MID(TEXT(N(HR$8),REPT(0,3)),2,1)>1,--MID(TEXT(N(HR$8),REPT(0,3)),2,1),0)","v":0},null,null,null,null,null,null,null,null,null,null,null,null,null,null,null,null,null,null,null,null,null,null,null,null,null,null,null,null,null,null,null,null,null,null,null,null,null,null,null,null,null,null,null,null,null,null,null,null,null,null,"Puluhan",{"$f":"N(\"Bila digit pertama angka puluhan > 1 MAKA hasilkan 1 digit angka depannya BILA TIDAK hasilkan Nol\")+IF(--MID(TEXT(N(JR$8),REPT(0,3)),2,1)>1,--MID(TEXT(N(JR$8),REPT(0,3)),2,1),0)","v":0},{"$f":"N(\"Bila digit pertama angka puluhan > 1 MAKA hasilkan 1 digit angka depannya BILA TIDAK hasilkan Nol\")+IF(--MID(TEXT(N(JS$8),REPT(0,3)),2,1)>1,--MID(TEXT(N(JS$8),REPT(0,3)),2,1),0)","v":0},{"$f":"N(\"Bila digit pertama angka puluhan > 1 MAKA hasilkan 1 digit angka depannya BILA TIDAK hasilkan Nol\")+IF(--MID(TEXT(N(JT$8),REPT(0,3)),2,1)>1,--MID(TEXT(N(JT$8),REPT(0,3)),2,1),0)","v":0},{"$f":"N(\"Bila digit pertama angka puluhan > 1 MAKA hasilkan 1 digit angka depannya BILA TIDAK hasilkan Nol\")+IF(--MID(TEXT(N(JU$8),REPT(0,3)),2,1)>1,--MID(TEXT(N(JU$8),REPT(0,3)),2,1),0)","v":0},null,null,null,null,null,null,null,null,null,null,null,null,null,null,null,null,null,null,null,null,null,null,null,null,null,null,null,null,null,null,null,null,null,null,null,null,null,null,null,null,null,null,null,null,null,null,null,null,null,null,"Puluhan",{"$f":"N(\"Bila digit pertama angka puluhan > 1 MAKA hasilkan 1 digit angka depannya BILA TIDAK hasilkan Nol\")+IF(--MID(TEXT(N(LU$8),REPT(0,3)),2,1)>1,--MID(TEXT(N(LU$8),REPT(0,3)),2,1),0)","v":0},{"$f":"N(\"Bila digit pertama angka puluhan > 1 MAKA hasilkan 1 digit angka depannya BILA TIDAK hasilkan Nol\")+IF(--MID(TEXT(N(LV$8),REPT(0,3)),2,1)>1,--MID(TEXT(N(LV$8),REPT(0,3)),2,1),0)","v":0},{"$f":"N(\"Bila digit pertama angka puluhan > 1 MAKA hasilkan 1 digit angka depannya BILA TIDAK hasilkan Nol\")+IF(--MID(TEXT(N(LW$8),REPT(0,3)),2,1)>1,--MID(TEXT(N(LW$8),REPT(0,3)),2,1),0)","v":0},{"$f":"N(\"Bila digit pertama angka puluhan > 1 MAKA hasilkan 1 digit angka depannya BILA TIDAK hasilkan Nol\")+IF(--MID(TEXT(N(LX$8),REPT(0,3)),2,1)>1,--MID(TEXT(N(LX$8),REPT(0,3)),2,1),0)","v":0},null,null,null,null,null,null,null,null,null,null,null,null,null,null,null,null,null,null,null,null,null,null,null,null,null,null,null,null,null,null,null,null,null,null,null,null,null,null,null,null,null,null,null,null,null,null,null,null,null,null,"Puluhan",{"$f":"N(\"Bila digit pertama angka puluhan > 1 MAKA hasilkan 1 digit angka depannya BILA TIDAK hasilkan Nol\")+IF(--MID(TEXT(N(NX$8),REPT(0,3)),2,1)>1,--MID(TEXT(N(NX$8),REPT(0,3)),2,1),0)","v":0},{"$f":"N(\"Bila digit pertama angka puluhan > 1 MAKA hasilkan 1 digit angka depannya BILA TIDAK hasilkan Nol\")+IF(--MID(TEXT(N(NY$8),REPT(0,3)),2,1)>1,--MID(TEXT(N(NY$8),REPT(0,3)),2,1),0)","v":0},{"$f":"N(\"Bila digit pertama angka puluhan > 1 MAKA hasilkan 1 digit angka depannya BILA TIDAK hasilkan Nol\")+IF(--MID(TEXT(N(NZ$8),REPT(0,3)),2,1)>1,--MID(TEXT(N(NZ$8),REPT(0,3)),2,1),0)","v":0},{"$f":"N(\"Bila digit pertama angka puluhan > 1 MAKA hasilkan 1 digit angka depannya BILA TIDAK hasilkan Nol\")+IF(--MID(TEXT(N(OA$8),REPT(0,3)),2,1)>1,--MID(TEXT(N(OA$8),REPT(0,3)),2,1),0)","v":0},null,null,null,null,null,null,null,null,null,null,null,null,null,null,null,null,null,null,null,null,null,null,null,null,null,null,null,null,null,null,null,null,null,null,null,null,null,null,null,null,null,null,null,null,null,null,null,null,null,null,"Puluhan",{"$f":"N(\"Bila digit pertama angka puluhan > 1 MAKA hasilkan 1 digit angka depannya BILA TIDAK hasilkan Nol\")+IF(--MID(TEXT(N(QA$8),REPT(0,3)),2,1)>1,--MID(TEXT(N(QA$8),REPT(0,3)),2,1),0)","v":0},{"$f":"N(\"Bila digit pertama angka puluhan > 1 MAKA hasilkan 1 digit angka depannya BILA TIDAK hasilkan Nol\")+IF(--MID(TEXT(N(QB$8),REPT(0,3)),2,1)>1,--MID(TEXT(N(QB$8),REPT(0,3)),2,1),0)","v":0},{"$f":"N(\"Bila digit pertama angka puluhan > 1 MAKA hasilkan 1 digit angka depannya BILA TIDAK hasilkan Nol\")+IF(--MID(TEXT(N(QC$8),REPT(0,3)),2,1)>1,--MID(TEXT(N(QC$8),REPT(0,3)),2,1),0)","v":0},{"$f":"N(\"Bila digit pertama angka puluhan > 1 MAKA hasilkan 1 digit angka depannya BILA TIDAK hasilkan Nol\")+IF(--MID(TEXT(N(QD$8),REPT(0,3)),2,1)>1,--MID(TEXT(N(QD$8),REPT(0,3)),2,1),0)","v":0},null,null,null,null,null,null,null,null,null,null,null,null,null,null,null,null,null,null,null,null,null,null,null,null,null,null,null,null,null,null,null,null,null,null,null,null,null,null,null,null,null,null,null,null,null,null,null,null,null,null,"Puluhan",{"$f":"N(\"Bila digit pertama angka puluhan > 1 MAKA hasilkan 1 digit angka depannya BILA TIDAK hasilkan Nol\")+IF(--MID(TEXT(N(SD$8),REPT(0,3)),2,1)>1,--MID(TEXT(N(SD$8),REPT(0,3)),2,1),0)","v":0},{"$f":"N(\"Bila digit pertama angka puluhan > 1 MAKA hasilkan 1 digit angka depannya BILA TIDAK hasilkan Nol\")+IF(--MID(TEXT(N(SE$8),REPT(0,3)),2,1)>1,--MID(TEXT(N(SE$8),REPT(0,3)),2,1),0)","v":0},{"$f":"N(\"Bila digit pertama angka puluhan > 1 MAKA hasilkan 1 digit angka depannya BILA TIDAK hasilkan Nol\")+IF(--MID(TEXT(N(SF$8),REPT(0,3)),2,1)>1,--MID(TEXT(N(SF$8),REPT(0,3)),2,1),0)","v":0},{"$f":"N(\"Bila digit pertama angka puluhan > 1 MAKA hasilkan 1 digit angka depannya BILA TIDAK hasilkan Nol\")+IF(--MID(TEXT(N(SG$8),REPT(0,3)),2,1)>1,--MID(TEXT(N(SG$8),REPT(0,3)),2,1),0)","v":0}]
[null,"Belasan & Satuan",{"$f":"N(\"Bila 2 digit terakhir > 19 MAKA hasilkan 1 digit terakhir BILA TIDAK hasilkan 2 digit terakhir\")+IF(--MID(TEXT(N(C$8),REPT(0,3)),2,2)>19,--MID(TEXT(N(C$8),REPT(0,3)),3,1),--MID(TEXT(N(C$8),REPT(0,3)),2,2))","v":0},{"$f":"N(\"Bila 2 digit terakhir > 19 MAKA hasilkan 1 digit terakhir BILA TIDAK hasilkan 2 digit terakhir\")+IF(--MID(TEXT(N(D$8),REPT(0,3)),2,2)>19,--MID(TEXT(N(D$8),REPT(0,3)),3,1),--MID(TEXT(N(D$8),REPT(0,3)),2,2))","v":5},{"$f":"N(\"Bila 2 digit terakhir > 19 MAKA hasilkan 1 digit terakhir BILA TIDAK hasilkan 2 digit terakhir\")+IF(--MID(TEXT(N(E$8),REPT(0,3)),2,2)>19,--MID(TEXT(N(E$8),REPT(0,3)),3,1),--MID(TEXT(N(E$8),REPT(0,3)),2,2))","v":0},{"$f":"N(\"Bila 2 digit terakhir > 19 MAKA hasilkan 1 digit terakhir BILA TIDAK hasilkan 2 digit terakhir\")+IF(--MID(TEXT(N(F$8),REPT(0,3)),2,2)>19,--MID(TEXT(N(F$8),REPT(0,3)),3,1),--MID(TEXT(N(F$8),REPT(0,3)),2,2))","v":0},null,null,null,null,null,null,null,null,null,null,null,null,null,null,null,null,null,null,null,null,null,null,null,null,null,null,null,null,null,null,null,null,null,null,null,null,null,null,null,null,null,null,null,null,null,null,null,null,null,null,"Belasan & Satuan",{"$f":"N(\"Bila 2 digit terakhir > 19 MAKA hasilkan 1 digit terakhir BILA TIDAK hasilkan 2 digit terakhir\")+IF(--MID(TEXT(N(BF$8),REPT(0,3)),2,2)>19,--MID(TEXT(N(BF$8),REPT(0,3)),3,1),--MID(TEXT(N(BF$8),REPT(0,3)),2,2))","v":0},{"$f":"N(\"Bila 2 digit terakhir > 19 MAKA hasilkan 1 digit terakhir BILA TIDAK hasilkan 2 digit terakhir\")+IF(--MID(TEXT(N(BG$8),REPT(0,3)),2,2)>19,--MID(TEXT(N(BG$8),REPT(0,3)),3,1),--MID(TEXT(N(BG$8),REPT(0,3)),2,2))","v":5},{"$f":"N(\"Bila 2 digit terakhir > 19 MAKA hasilkan 1 digit terakhir BILA TIDAK hasilkan 2 digit terakhir\")+IF(--MID(TEXT(N(BH$8),REPT(0,3)),2,2)>19,--MID(TEXT(N(BH$8),REPT(0,3)),3,1),--MID(TEXT(N(BH$8),REPT(0,3)),2,2))","v":0},{"$f":"N(\"Bila 2 digit terakhir > 19 MAKA hasilkan 1 digit terakhir BILA TIDAK hasilkan 2 digit terakhir\")+IF(--MID(TEXT(N(BI$8),REPT(0,3)),2,2)>19,--MID(TEXT(N(BI$8),REPT(0,3)),3,1),--MID(TEXT(N(BI$8),REPT(0,3)),2,2))","v":0},null,null,null,null,null,null,null,null,null,null,null,null,null,null,null,null,null,null,null,null,null,null,null,null,null,null,null,null,null,null,null,null,null,null,null,null,null,null,null,null,null,null,null,null,null,null,null,null,null,null,"Belasan & Satuan",{"$f":"N(\"Bila 2 digit terakhir > 19 MAKA hasilkan 1 digit terakhir BILA TIDAK hasilkan 2 digit terakhir\")+IF(--MID(TEXT(N(DI$8),REPT(0,3)),2,2)>19,--MID(TEXT(N(DI$8),REPT(0,3)),3,1),--MID(TEXT(N(DI$8),REPT(0,3)),2,2))","v":0},{"$f":"N(\"Bila 2 digit terakhir > 19 MAKA hasilkan 1 digit terakhir BILA TIDAK hasilkan 2 digit terakhir\")+IF(--MID(TEXT(N(DJ$8),REPT(0,3)),2,2)>19,--MID(TEXT(N(DJ$8),REPT(0,3)),3,1),--MID(TEXT(N(DJ$8),REPT(0,3)),2,2))","v":5},{"$f":"N(\"Bila 2 digit terakhir > 19 MAKA hasilkan 1 digit terakhir BILA TIDAK hasilkan 2 digit terakhir\")+IF(--MID(TEXT(N(DK$8),REPT(0,3)),2,2)>19,--MID(TEXT(N(DK$8),REPT(0,3)),3,1),--MID(TEXT(N(DK$8),REPT(0,3)),2,2))","v":0},{"$f":"N(\"Bila 2 digit terakhir > 19 MAKA hasilkan 1 digit terakhir BILA TIDAK hasilkan 2 digit terakhir\")+IF(--MID(TEXT(N(DL$8),REPT(0,3)),2,2)>19,--MID(TEXT(N(DL$8),REPT(0,3)),3,1),--MID(TEXT(N(DL$8),REPT(0,3)),2,2))","v":0},null,null,null,null,null,null,null,null,null,null,null,null,null,null,null,null,null,null,null,null,null,null,null,null,null,null,null,null,null,null,null,null,null,null,null,null,null,null,null,null,null,null,null,null,null,null,null,null,null,null,"Belasan & Satuan",{"$f":"N(\"Bila 2 digit terakhir > 19 MAKA hasilkan 1 digit terakhir BILA TIDAK hasilkan 2 digit terakhir\")+IF(--MID(TEXT(N(FL$8),REPT(0,3)),2,2)>19,--MID(TEXT(N(FL$8),REPT(0,3)),3,1),--MID(TEXT(N(FL$8),REPT(0,3)),2,2))","v":0},{"$f":"N(\"Bila 2 digit terakhir > 19 MAKA hasilkan 1 digit terakhir BILA TIDAK hasilkan 2 digit terakhir\")+IF(--MID(TEXT(N(FM$8),REPT(0,3)),2,2)>19,--MID(TEXT(N(FM$8),REPT(0,3)),3,1),--MID(TEXT(N(FM$8),REPT(0,3)),2,2))","v":5},{"$f":"N(\"Bila 2 digit terakhir > 19 MAKA hasilkan 1 digit terakhir BILA TIDAK hasilkan 2 digit terakhir\")+IF(--MID(TEXT(N(FN$8),REPT(0,3)),2,2)>19,--MID(TEXT(N(FN$8),REPT(0,3)),3,1),--MID(TEXT(N(FN$8),REPT(0,3)),2,2))","v":0},{"$f":"N(\"Bila 2 digit terakhir > 19 MAKA hasilkan 1 digit terakhir BILA TIDAK hasilkan 2 digit terakhir\")+IF(--MID(TEXT(N(FO$8),REPT(0,3)),2,2)>19,--MID(TEXT(N(FO$8),REPT(0,3)),3,1),--MID(TEXT(N(FO$8),REPT(0,3)),2,2))","v":0},null,null,null,null,null,null,null,null,null,null,null,null,null,null,null,null,null,null,null,null,null,null,null,null,null,null,null,null,null,null,null,null,null,null,null,null,null,null,null,null,null,null,null,null,null,null,null,null,null,null,"Belasan & Satuan",{"$f":"N(\"Bila 2 digit terakhir > 19 MAKA hasilkan 1 digit terakhir BILA TIDAK hasilkan 2 digit terakhir\")+IF(--MID(TEXT(N(HO$8),REPT(0,3)),2,2)>19,--MID(TEXT(N(HO$8),REPT(0,3)),3,1),--MID(TEXT(N(HO$8),REPT(0,3)),2,2))","v":0},{"$f":"N(\"Bila 2 digit terakhir > 19 MAKA hasilkan 1 digit terakhir BILA TIDAK hasilkan 2 digit terakhir\")+IF(--MID(TEXT(N(HP$8),REPT(0,3)),2,2)>19,--MID(TEXT(N(HP$8),REPT(0,3)),3,1),--MID(TEXT(N(HP$8),REPT(0,3)),2,2))","v":5},{"$f":"N(\"Bila 2 digit terakhir > 19 MAKA hasilkan 1 digit terakhir BILA TIDAK hasilkan 2 digit terakhir\")+IF(--MID(TEXT(N(HQ$8),REPT(0,3)),2,2)>19,--MID(TEXT(N(HQ$8),REPT(0,3)),3,1),--MID(TEXT(N(HQ$8),REPT(0,3)),2,2))","v":0},{"$f":"N(\"Bila 2 digit terakhir > 19 MAKA hasilkan 1 digit terakhir BILA TIDAK hasilkan 2 digit terakhir\")+IF(--MID(TEXT(N(HR$8),REPT(0,3)),2,2)>19,--MID(TEXT(N(HR$8),REPT(0,3)),3,1),--MID(TEXT(N(HR$8),REPT(0,3)),2,2))","v":0},null,null,null,null,null,null,null,null,null,null,null,null,null,null,null,null,null,null,null,null,null,null,null,null,null,null,null,null,null,null,null,null,null,null,null,null,null,null,null,null,null,null,null,null,null,null,null,null,null,null,"Belasan & Satuan",{"$f":"N(\"Bila 2 digit terakhir > 19 MAKA hasilkan 1 digit terakhir BILA TIDAK hasilkan 2 digit terakhir\")+IF(--MID(TEXT(N(JR$8),REPT(0,3)),2,2)>19,--MID(TEXT(N(JR$8),REPT(0,3)),3,1),--MID(TEXT(N(JR$8),REPT(0,3)),2,2))","v":0},{"$f":"N(\"Bila 2 digit terakhir > 19 MAKA hasilkan 1 digit terakhir BILA TIDAK hasilkan 2 digit terakhir\")+IF(--MID(TEXT(N(JS$8),REPT(0,3)),2,2)>19,--MID(TEXT(N(JS$8),REPT(0,3)),3,1),--MID(TEXT(N(JS$8),REPT(0,3)),2,2))","v":5},{"$f":"N(\"Bila 2 digit terakhir > 19 MAKA hasilkan 1 digit terakhir BILA TIDAK hasilkan 2 digit terakhir\")+IF(--MID(TEXT(N(JT$8),REPT(0,3)),2,2)>19,--MID(TEXT(N(JT$8),REPT(0,3)),3,1),--MID(TEXT(N(JT$8),REPT(0,3)),2,2))","v":0},{"$f":"N(\"Bila 2 digit terakhir > 19 MAKA hasilkan 1 digit terakhir BILA TIDAK hasilkan 2 digit terakhir\")+IF(--MID(TEXT(N(JU$8),REPT(0,3)),2,2)>19,--MID(TEXT(N(JU$8),REPT(0,3)),3,1),--MID(TEXT(N(JU$8),REPT(0,3)),2,2))","v":0},null,null,null,null,null,null,null,null,null,null,null,null,null,null,null,null,null,null,null,null,null,null,null,null,null,null,null,null,null,null,null,null,null,null,null,null,null,null,null,null,null,null,null,null,null,null,null,null,null,null,"Belasan & Satuan",{"$f":"N(\"Bila 2 digit terakhir > 19 MAKA hasilkan 1 digit terakhir BILA TIDAK hasilkan 2 digit terakhir\")+IF(--MID(TEXT(N(LU$8),REPT(0,3)),2,2)>19,--MID(TEXT(N(LU$8),REPT(0,3)),3,1),--MID(TEXT(N(LU$8),REPT(0,3)),2,2))","v":0},{"$f":"N(\"Bila 2 digit terakhir > 19 MAKA hasilkan 1 digit terakhir BILA TIDAK hasilkan 2 digit terakhir\")+IF(--MID(TEXT(N(LV$8),REPT(0,3)),2,2)>19,--MID(TEXT(N(LV$8),REPT(0,3)),3,1),--MID(TEXT(N(LV$8),REPT(0,3)),2,2))","v":5},{"$f":"N(\"Bila 2 digit terakhir > 19 MAKA hasilkan 1 digit terakhir BILA TIDAK hasilkan 2 digit terakhir\")+IF(--MID(TEXT(N(LW$8),REPT(0,3)),2,2)>19,--MID(TEXT(N(LW$8),REPT(0,3)),3,1),--MID(TEXT(N(LW$8),REPT(0,3)),2,2))","v":0},{"$f":"N(\"Bila 2 digit terakhir > 19 MAKA hasilkan 1 digit terakhir BILA TIDAK hasilkan 2 digit terakhir\")+IF(--MID(TEXT(N(LX$8),REPT(0,3)),2,2)>19,--MID(TEXT(N(LX$8),REPT(0,3)),3,1),--MID(TEXT(N(LX$8),REPT(0,3)),2,2))","v":0},null,null,null,null,null,null,null,null,null,null,null,null,null,null,null,null,null,null,null,null,null,null,null,null,null,null,null,null,null,null,null,null,null,null,null,null,null,null,null,null,null,null,null,null,null,null,null,null,null,null,"Belasan & Satuan",{"$f":"N(\"Bila 2 digit terakhir > 19 MAKA hasilkan 1 digit terakhir BILA TIDAK hasilkan 2 digit terakhir\")+IF(--MID(TEXT(N(NX$8),REPT(0,3)),2,2)>19,--MID(TEXT(N(NX$8),REPT(0,3)),3,1),--MID(TEXT(N(NX$8),REPT(0,3)),2,2))","v":0},{"$f":"N(\"Bila 2 digit terakhir > 19 MAKA hasilkan 1 digit terakhir BILA TIDAK hasilkan 2 digit terakhir\")+IF(--MID(TEXT(N(NY$8),REPT(0,3)),2,2)>19,--MID(TEXT(N(NY$8),REPT(0,3)),3,1),--MID(TEXT(N(NY$8),REPT(0,3)),2,2))","v":5},{"$f":"N(\"Bila 2 digit terakhir > 19 MAKA hasilkan 1 digit terakhir BILA TIDAK hasilkan 2 digit terakhir\")+IF(--MID(TEXT(N(NZ$8),REPT(0,3)),2,2)>19,--MID(TEXT(N(NZ$8),REPT(0,3)),3,1),--MID(TEXT(N(NZ$8),REPT(0,3)),2,2))","v":0},{"$f":"N(\"Bila 2 digit terakhir > 19 MAKA hasilkan 1 digit terakhir BILA TIDAK hasilkan 2 digit terakhir\")+IF(--MID(TEXT(N(OA$8),REPT(0,3)),2,2)>19,--MID(TEXT(N(OA$8),REPT(0,3)),3,1),--MID(TEXT(N(OA$8),REPT(0,3)),2,2))","v":0},null,null,null,null,null,null,null,null,null,null,null,null,null,null,null,null,null,null,null,null,null,null,null,null,null,null,null,null,null,null,null,null,null,null,null,null,null,null,null,null,null,null,null,null,null,null,null,null,null,null,"Belasan & Satuan",{"$f":"N(\"Bila 2 digit terakhir > 19 MAKA hasilkan 1 digit terakhir BILA TIDAK hasilkan 2 digit terakhir\")+IF(--MID(TEXT(N(QA$8),REPT(0,3)),2,2)>19,--MID(TEXT(N(QA$8),REPT(0,3)),3,1),--MID(TEXT(N(QA$8),REPT(0,3)),2,2))","v":0},{"$f":"N(\"Bila 2 digit terakhir > 19 MAKA hasilkan 1 digit terakhir BILA TIDAK hasilkan 2 digit terakhir\")+IF(--MID(TEXT(N(QB$8),REPT(0,3)),2,2)>19,--MID(TEXT(N(QB$8),REPT(0,3)),3,1),--MID(TEXT(N(QB$8),REPT(0,3)),2,2))","v":6},{"$f":"N(\"Bila 2 digit terakhir > 19 MAKA hasilkan 1 digit terakhir BILA TIDAK hasilkan 2 digit terakhir\")+IF(--MID(TEXT(N(QC$8),REPT(0,3)),2,2)>19,--MID(TEXT(N(QC$8),REPT(0,3)),3,1),--MID(TEXT(N(QC$8),REPT(0,3)),2,2))","v":0},{"$f":"N(\"Bila 2 digit terakhir > 19 MAKA hasilkan 1 digit terakhir BILA TIDAK hasilkan 2 digit terakhir\")+IF(--MID(TEXT(N(QD$8),REPT(0,3)),2,2)>19,--MID(TEXT(N(QD$8),REPT(0,3)),3,1),--MID(TEXT(N(QD$8),REPT(0,3)),2,2))","v":0},null,null,null,null,null,null,null,null,null,null,null,null,null,null,null,null,null,null,null,null,null,null,null,null,null,null,null,null,null,null,null,null,null,null,null,null,null,null,null,null,null,null,null,null,null,null,null,null,null,null,"Belasan & Satuan",{"$f":"N(\"Bila 2 digit terakhir > 19 MAKA hasilkan 1 digit terakhir BILA TIDAK hasilkan 2 digit terakhir\")+IF(--MID(TEXT(N(SD$8),REPT(0,3)),2,2)>19,--MID(TEXT(N(SD$8),REPT(0,3)),3,1),--MID(TEXT(N(SD$8),REPT(0,3)),2,2))","v":0},{"$f":"N(\"Bila 2 digit terakhir > 19 MAKA hasilkan 1 digit terakhir BILA TIDAK hasilkan 2 digit terakhir\")+IF(--MID(TEXT(N(SE$8),REPT(0,3)),2,2)>19,--MID(TEXT(N(SE$8),REPT(0,3)),3,1),--MID(TEXT(N(SE$8),REPT(0,3)),2,2))","v":9},{"$f":"N(\"Bila 2 digit terakhir > 19 MAKA hasilkan 1 digit terakhir BILA TIDAK hasilkan 2 digit terakhir\")+IF(--MID(TEXT(N(SF$8),REPT(0,3)),2,2)>19,--MID(TEXT(N(SF$8),REPT(0,3)),3,1),--MID(TEXT(N(SF$8),REPT(0,3)),2,2))","v":0},{"$f":"N(\"Bila 2 digit terakhir > 19 MAKA hasilkan 1 digit terakhir BILA TIDAK hasilkan 2 digit terakhir\")+IF(--MID(TEXT(N(SG$8),REPT(0,3)),2,2)>19,--MID(TEXT(N(SG$8),REPT(0,3)),3,1),--MID(TEXT(N(SG$8),REPT(0,3)),2,2))","v":0}]
[null,"Tahap 1",{"$f":"IF(C9=0,\" \",VLOOKUP(C9,tblTerbilang,2,0)&\" ratus \")&IF(C10=0,\" \",VLOOKUP(C10,tblTerbilang,2,0)&\" puluh \")&IF(C11=0,\" \",VLOOKUP(C11,tblTerbilang,2,0))&IF(SUM(C9:C11)=0,\" \",\" milyar \")","v":"    "},{"$f":"IF(D9=0,\" \",VLOOKUP(D9,tblTerbilang,2,0)&\" ratus \")&IF(D10=0,\" \",VLOOKUP(D10,tblTerbilang,2,0)&\" puluh \")&IF(D11=0,\" \",VLOOKUP(D11,tblTerbilang,2,0))&IF(SUM(D9:D11)=0,\" \",\" juta \")","v":"  lima juta "},{"$f":"IF(E9=0,\" \",VLOOKUP(E9,tblTerbilang,2,0)&\" ratus \")&IF(E10=0,\" \",VLOOKUP(E10,tblTerbilang,2,0)&\" puluh \")&IF(E11=0,\" \",VLOOKUP(E11,tblTerbilang,2,0))&IF(SUM(E9:E11)=0,\" \",\" ribu \")","v":"    "},{"$f":"IF(F9=0,\" \",VLOOKUP(F9,tblTerbilang,2,0)&\" ratus \")&IF(F10=0,\" \",VLOOKUP(F10,tblTerbilang,2,0)&\" puluh \")&IF(F11=0,\" \",VLOOKUP(F11,tblTerbilang,2,0)&\" \")","v":"   "},null,null,null,null,null,null,null,null,null,null,null,null,null,null,null,null,null,null,null,null,null,null,null,null,null,null,null,null,null,null,null,null,null,null,null,null,null,null,null,null,null,null,null,null,null,null,null,null,null,null,"Tahap 1",{"$f":"IF(BF9=0,\" \",VLOOKUP(BF9,tblTerbilang,2,0)&\" ratus \")&IF(BF10=0,\" \",VLOOKUP(BF10,tblTerbilang,2,0)&\" puluh \")&IF(BF11=0,\" \",VLOOKUP(BF11,tblTerbilang,2,0))&IF(SUM(BF9:BF11)=0,\" \",\" milyar \")","v":"    "},{"$f":"IF(BG9=0,\" \",VLOOKUP(BG9,tblTerbilang,2,0)&\" ratus \")&IF(BG10=0,\" \",VLOOKUP(BG10,tblTerbilang,2,0)&\" puluh \")&IF(BG11=0,\" \",VLOOKUP(BG11,tblTerbilang,2,0))&IF(SUM(BG9:BG11)=0,\" \",\" juta \")","v":"  lima juta "},{"$f":"IF(BH9=0,\" \",VLOOKUP(BH9,tblTerbilang,2,0)&\" ratus \")&IF(BH10=0,\" \",VLOOKUP(BH10,tblTerbilang,2,0)&\" puluh \")&IF(BH11=0,\" \",VLOOKUP(BH11,tblTerbilang,2,0))&IF(SUM(BH9:BH11)=0,\" \",\" ribu \")","v":"    "},{"$f":"IF(BI9=0,\" \",VLOOKUP(BI9,tblTerbilang,2,0)&\" ratus \")&IF(BI10=0,\" \",VLOOKUP(BI10,tblTerbilang,2,0)&\" puluh \")&IF(BI11=0,\" \",VLOOKUP(BI11,tblTerbilang,2,0)&\" \")","v":"   "},null,null,null,null,null,null,null,null,null,null,null,null,null,null,null,null,null,null,null,null,null,null,null,null,null,null,null,null,null,null,null,null,null,null,null,null,null,null,null,null,null,null,null,null,null,null,null,null,null,null,"Tahap 1",{"$f":"IF(DI9=0,\" \",VLOOKUP(DI9,tblTerbilang,2,0)&\" ratus \")&IF(DI10=0,\" \",VLOOKUP(DI10,tblTerbilang,2,0)&\" puluh \")&IF(DI11=0,\" \",VLOOKUP(DI11,tblTerbilang,2,0))&IF(SUM(DI9:DI11)=0,\" \",\" milyar \")","v":"    "},{"$f":"IF(DJ9=0,\" \",VLOOKUP(DJ9,tblTerbilang,2,0)&\" ratus \")&IF(DJ10=0,\" \",VLOOKUP(DJ10,tblTerbilang,2,0)&\" puluh \")&IF(DJ11=0,\" \",VLOOKUP(DJ11,tblTerbilang,2,0))&IF(SUM(DJ9:DJ11)=0,\" \",\" juta \")","v":"  lima juta "},{"$f":"IF(DK9=0,\" \",VLOOKUP(DK9,tblTerbilang,2,0)&\" ratus \")&IF(DK10=0,\" \",VLOOKUP(DK10,tblTerbilang,2,0)&\" puluh \")&IF(DK11=0,\" \",VLOOKUP(DK11,tblTerbilang,2,0))&IF(SUM(DK9:DK11)=0,\" \",\" ribu \")","v":"    "},{"$f":"IF(DL9=0,\" \",VLOOKUP(DL9,tblTerbilang,2,0)&\" ratus \")&IF(DL10=0,\" \",VLOOKUP(DL10,tblTerbilang,2,0)&\" puluh \")&IF(DL11=0,\" \",VLOOKUP(DL11,tblTerbilang,2,0)&\" \")","v":"   "},null,null,null,null,null,null,null,null,null,null,null,null,null,null,null,null,null,null,null,null,null,null,null,null,null,null,null,null,null,null,null,null,null,null,null,null,null,null,null,null,null,null,null,null,null,null,null,null,null,null,"Tahap 1",{"$f":"IF(FL9=0,\" \",VLOOKUP(FL9,tblTerbilang,2,0)&\" ratus \")&IF(FL10=0,\" \",VLOOKUP(FL10,tblTerbilang,2,0)&\" puluh \")&IF(FL11=0,\" \",VLOOKUP(FL11,tblTerbilang,2,0))&IF(SUM(FL9:FL11)=0,\" \",\" milyar \")","v":"    "},{"$f":"IF(FM9=0,\" \",VLOOKUP(FM9,tblTerbilang,2,0)&\" ratus \")&IF(FM10=0,\" \",VLOOKUP(FM10,tblTerbilang,2,0)&\" puluh \")&IF(FM11=0,\" \",VLOOKUP(FM11,tblTerbilang,2,0))&IF(SUM(FM9:FM11)=0,\" \",\" juta \")","v":"  lima juta "},{"$f":"IF(FN9=0,\" \",VLOOKUP(FN9,tblTerbilang,2,0)&\" ratus \")&IF(FN10=0,\" \",VLOOKUP(FN10,tblTerbilang,2,0)&\" puluh \")&IF(FN11=0,\" \",VLOOKUP(FN11,tblTerbilang,2,0))&IF(SUM(FN9:FN11)=0,\" \",\" ribu \")","v":"    "},{"$f":"IF(FO9=0,\" \",VLOOKUP(FO9,tblTerbilang,2,0)&\" ratus \")&IF(FO10=0,\" \",VLOOKUP(FO10,tblTerbilang,2,0)&\" puluh \")&IF(FO11=0,\" \",VLOOKUP(FO11,tblTerbilang,2,0)&\" \")","v":"   "},null,null,null,null,null,null,null,null,null,null,null,null,null,null,null,null,null,null,null,null,null,null,null,null,null,null,null,null,null,null,null,null,null,null,null,null,null,null,null,null,null,null,null,null,null,null,null,null,null,null,"Tahap 1",{"$f":"IF(HO9=0,\" \",VLOOKUP(HO9,tblTerbilang,2,0)&\" ratus \")&IF(HO10=0,\" \",VLOOKUP(HO10,tblTerbilang,2,0)&\" puluh \")&IF(HO11=0,\" \",VLOOKUP(HO11,tblTerbilang,2,0))&IF(SUM(HO9:HO11)=0,\" \",\" milyar \")","v":"    "},{"$f":"IF(HP9=0,\" \",VLOOKUP(HP9,tblTerbilang,2,0)&\" ratus \")&IF(HP10=0,\" \",VLOOKUP(HP10,tblTerbilang,2,0)&\" puluh \")&IF(HP11=0,\" \",VLOOKUP(HP11,tblTerbilang,2,0))&IF(SUM(HP9:HP11)=0,\" \",\" juta \")","v":"  lima juta "},{"$f":"IF(HQ9=0,\" \",VLOOKUP(HQ9,tblTerbilang,2,0)&\" ratus \")&IF(HQ10=0,\" \",VLOOKUP(HQ10,tblTerbilang,2,0)&\" puluh \")&IF(HQ11=0,\" \",VLOOKUP(HQ11,tblTerbilang,2,0))&IF(SUM(HQ9:HQ11)=0,\" \",\" ribu \")","v":"    "},{"$f":"IF(HR9=0,\" \",VLOOKUP(HR9,tblTerbilang,2,0)&\" ratus \")&IF(HR10=0,\" \",VLOOKUP(HR10,tblTerbilang,2,0)&\" puluh \")&IF(HR11=0,\" \",VLOOKUP(HR11,tblTerbilang,2,0)&\" \")","v":"   "},null,null,null,null,null,null,null,null,null,null,null,null,null,null,null,null,null,null,null,null,null,null,null,null,null,null,null,null,null,null,null,null,null,null,null,null,null,null,null,null,null,null,null,null,null,null,null,null,null,null,"Tahap 1",{"$f":"IF(JR9=0,\" \",VLOOKUP(JR9,tblTerbilang,2,0)&\" ratus \")&IF(JR10=0,\" \",VLOOKUP(JR10,tblTerbilang,2,0)&\" puluh \")&IF(JR11=0,\" \",VLOOKUP(JR11,tblTerbilang,2,0))&IF(SUM(JR9:JR11)=0,\" \",\" milyar \")","v":"    "},{"$f":"IF(JS9=0,\" \",VLOOKUP(JS9,tblTerbilang,2,0)&\" ratus \")&IF(JS10=0,\" \",VLOOKUP(JS10,tblTerbilang,2,0)&\" puluh \")&IF(JS11=0,\" \",VLOOKUP(JS11,tblTerbilang,2,0))&IF(SUM(JS9:JS11)=0,\" \",\" juta \")","v":"  lima juta "},{"$f":"IF(JT9=0,\" \",VLOOKUP(JT9,tblTerbilang,2,0)&\" ratus \")&IF(JT10=0,\" \",VLOOKUP(JT10,tblTerbilang,2,0)&\" puluh \")&IF(JT11=0,\" \",VLOOKUP(JT11,tblTerbilang,2,0))&IF(SUM(JT9:JT11)=0,\" \",\" ribu \")","v":"    "},{"$f":"IF(JU9=0,\" \",VLOOKUP(JU9,tblTerbilang,2,0)&\" ratus \")&IF(JU10=0,\" \",VLOOKUP(JU10,tblTerbilang,2,0)&\" puluh \")&IF(JU11=0,\" \",VLOOKUP(JU11,tblTerbilang,2,0)&\" \")","v":"   "},null,null,null,null,null,null,null,null,null,null,null,null,null,null,null,null,null,null,null,null,null,null,null,null,null,null,null,null,null,null,null,null,null,null,null,null,null,null,null,null,null,null,null,null,null,null,null,null,null,null,"Tahap 1",{"$f":"IF(LU9=0,\" \",VLOOKUP(LU9,tblTerbilang,2,0)&\" ratus \")&IF(LU10=0,\" \",VLOOKUP(LU10,tblTerbilang,2,0)&\" puluh \")&IF(LU11=0,\" \",VLOOKUP(LU11,tblTerbilang,2,0))&IF(SUM(LU9:LU11)=0,\" \",\" milyar \")","v":"    "},{"$f":"IF(LV9=0,\" \",VLOOKUP(LV9,tblTerbilang,2,0)&\" ratus \")&IF(LV10=0,\" \",VLOOKUP(LV10,tblTerbilang,2,0)&\" puluh \")&IF(LV11=0,\" \",VLOOKUP(LV11,tblTerbilang,2,0))&IF(SUM(LV9:LV11)=0,\" \",\" juta \")","v":"  lima juta "},{"$f":"IF(LW9=0,\" \",VLOOKUP(LW9,tblTerbilang,2,0)&\" ratus \")&IF(LW10=0,\" \",VLOOKUP(LW10,tblTerbilang,2,0)&\" puluh \")&IF(LW11=0,\" \",VLOOKUP(LW11,tblTerbilang,2,0))&IF(SUM(LW9:LW11)=0,\" \",\" ribu \")","v":"    "},{"$f":"IF(LX9=0,\" \",VLOOKUP(LX9,tblTerbilang,2,0)&\" ratus \")&IF(LX10=0,\" \",VLOOKUP(LX10,tblTerbilang,2,0)&\" puluh \")&IF(LX11=0,\" \",VLOOKUP(LX11,tblTerbilang,2,0)&\" \")","v":"   "},null,null,null,null,null,null,null,null,null,null,null,null,null,null,null,null,null,null,null,null,null,null,null,null,null,null,null,null,null,null,null,null,null,null,null,null,null,null,null,null,null,null,null,null,null,null,null,null,null,null,"Tahap 1",{"$f":"IF(NX9=0,\" \",VLOOKUP(NX9,tblTerbilang,2,0)&\" ratus \")&IF(NX10=0,\" \",VLOOKUP(NX10,tblTerbilang,2,0)&\" puluh \")&IF(NX11=0,\" \",VLOOKUP(NX11,tblTerbilang,2,0))&IF(SUM(NX9:NX11)=0,\" \",\" milyar \")","v":"    "},{"$f":"IF(NY9=0,\" \",VLOOKUP(NY9,tblTerbilang,2,0)&\" ratus \")&IF(NY10=0,\" \",VLOOKUP(NY10,tblTerbilang,2,0)&\" puluh \")&IF(NY11=0,\" \",VLOOKUP(NY11,tblTerbilang,2,0))&IF(SUM(NY9:NY11)=0,\" \",\" juta \")","v":"  lima juta "},{"$f":"IF(NZ9=0,\" \",VLOOKUP(NZ9,tblTerbilang,2,0)&\" ratus \")&IF(NZ10=0,\" \",VLOOKUP(NZ10,tblTerbilang,2,0)&\" puluh \")&IF(NZ11=0,\" \",VLOOKUP(NZ11,tblTerbilang,2,0))&IF(SUM(NZ9:NZ11)=0,\" \",\" ribu \")","v":"    "},{"$f":"IF(OA9=0,\" \",VLOOKUP(OA9,tblTerbilang,2,0)&\" ratus \")&IF(OA10=0,\" \",VLOOKUP(OA10,tblTerbilang,2,0)&\" puluh \")&IF(OA11=0,\" \",VLOOKUP(OA11,tblTerbilang,2,0)&\" \")","v":"   "},null,null,null,null,null,null,null,null,null,null,null,null,null,null,null,null,null,null,null,null,null,null,null,null,null,null,null,null,null,null,null,null,null,null,null,null,null,null,null,null,null,null,null,null,null,null,null,null,null,null,"Tahap 1",{"$f":"IF(QA9=0,\" \",VLOOKUP(QA9,tblTerbilang,2,0)&\" ratus \")&IF(QA10=0,\" \",VLOOKUP(QA10,tblTerbilang,2,0)&\" puluh \")&IF(QA11=0,\" \",VLOOKUP(QA11,tblTerbilang,2,0))&IF(SUM(QA9:QA11)=0,\" \",\" milyar \")","v":"    "},{"$f":"IF(QB9=0,\" \",VLOOKUP(QB9,tblTerbilang,2,0)&\" ratus \")&IF(QB10=0,\" \",VLOOKUP(QB10,tblTerbilang,2,0)&\" puluh \")&IF(QB11=0,\" \",VLOOKUP(QB11,tblTerbilang,2,0))&IF(SUM(QB9:QB11)=0,\" \",\" juta \")","v":"  enam juta "},{"$f":"IF(QC9=0,\" \",VLOOKUP(QC9,tblTerbilang,2,0)&\" ratus \")&IF(QC10=0,\" \",VLOOKUP(QC10,tblTerbilang,2,0)&\" puluh \")&IF(QC11=0,\" \",VLOOKUP(QC11,tblTerbilang,2,0))&IF(SUM(QC9:QC11)=0,\" \",\" ribu \")","v":"    "},{"$f":"IF(QD9=0,\" \",VLOOKUP(QD9,tblTerbilang,2,0)&\" ratus \")&IF(QD10=0,\" \",VLOOKUP(QD10,tblTerbilang,2,0)&\" puluh \")&IF(QD11=0,\" \",VLOOKUP(QD11,tblTerbilang,2,0)&\" \")","v":"   "},null,null,null,null,null,null,null,null,null,null,null,null,null,null,null,null,null,null,null,null,null,null,null,null,null,null,null,null,null,null,null,null,null,null,null,null,null,null,null,null,null,null,null,null,null,null,null,null,null,null,"Tahap 1",{"$f":"IF(SD9=0,\" \",VLOOKUP(SD9,tblTerbilang,2,0)&\" ratus \")&IF(SD10=0,\" \",VLOOKUP(SD10,tblTerbilang,2,0)&\" puluh \")&IF(SD11=0,\" \",VLOOKUP(SD11,tblTerbilang,2,0))&IF(SUM(SD9:SD11)=0,\" \",\" milyar \")","v":"    "},{"$f":"IF(SE9=0,\" \",VLOOKUP(SE9,tblTerbilang,2,0)&\" ratus \")&IF(SE10=0,\" \",VLOOKUP(SE10,tblTerbilang,2,0)&\" puluh \")&IF(SE11=0,\" \",VLOOKUP(SE11,tblTerbilang,2,0))&IF(SUM(SE9:SE11)=0,\" \",\" juta \")","v":"  sembilan juta "},{"$f":"IF(SF9=0,\" \",VLOOKUP(SF9,tblTerbilang,2,0)&\" ratus \")&IF(SF10=0,\" \",VLOOKUP(SF10,tblTerbilang,2,0)&\" puluh \")&IF(SF11=0,\" \",VLOOKUP(SF11,tblTerbilang,2,0))&IF(SUM(SF9:SF11)=0,\" \",\" ribu \")","v":"    "},{"$f":"IF(SG9=0,\" \",VLOOKUP(SG9,tblTerbilang,2,0)&\" ratus \")&IF(SG10=0,\" \",VLOOKUP(SG10,tblTerbilang,2,0)&\" puluh \")&IF(SG11=0,\" \",VLOOKUP(SG11,tblTerbilang,2,0)&\" \")","v":"   "}]
[null,"Tahap 2",{"$f":"TRIM(SUBSTITUTE(SUBSTITUTE(IF(C8=1,SUBSTITUTE(TRIM(C12),\"satu ribu\",\" seribu \"),TRIM(C12)),\"satu ratus\",\" seratus \"),\"satu puluh\",\" sepuluh \"))","v":""},{"$f":"TRIM(SUBSTITUTE(SUBSTITUTE(IF(D8=1,SUBSTITUTE(TRIM(D12),\"satu ribu\",\" seribu \"),TRIM(D12)),\"satu ratus\",\" seratus \"),\"satu puluh\",\" sepuluh \"))","v":"lima juta"},{"$f":"TRIM(SUBSTITUTE(SUBSTITUTE(IF(E8=1,SUBSTITUTE(TRIM(E12),\"satu ribu\",\" seribu \"),TRIM(E12)),\"satu ratus\",\" seratus \"),\"satu puluh\",\" sepuluh \"))","v":""},{"$f":"TRIM(SUBSTITUTE(SUBSTITUTE(IF(F8=1,SUBSTITUTE(TRIM(F12),\"satu ribu\",\" seribu \"),TRIM(F12)),\"satu ratus\",\" seratus \"),\"satu puluh\",\" sepuluh \"))","v":""},null,null,null,null,null,null,null,null,null,null,null,null,null,null,null,null,null,null,null,null,null,null,null,null,null,null,null,null,null,null,null,null,null,null,null,null,null,null,null,null,null,null,null,null,null,null,null,null,null,null,"Tahap 2",{"$f":"TRIM(SUBSTITUTE(SUBSTITUTE(IF(BF8=1,SUBSTITUTE(TRIM(BF12),\"satu ribu\",\" seribu \"),TRIM(BF12)),\"satu ratus\",\" seratus \"),\"satu puluh\",\" sepuluh \"))","v":""},{"$f":"TRIM(SUBSTITUTE(SUBSTITUTE(IF(BG8=1,SUBSTITUTE(TRIM(BG12),\"satu ribu\",\" seribu \"),TRIM(BG12)),\"satu ratus\",\" seratus \"),\"satu puluh\",\" sepuluh \"))","v":"lima juta"},{"$f":"TRIM(SUBSTITUTE(SUBSTITUTE(IF(BH8=1,SUBSTITUTE(TRIM(BH12),\"satu ribu\",\" seribu \"),TRIM(BH12)),\"satu ratus\",\" seratus \"),\"satu puluh\",\" sepuluh \"))","v":""},{"$f":"TRIM(SUBSTITUTE(SUBSTITUTE(IF(BI8=1,SUBSTITUTE(TRIM(BI12),\"satu ribu\",\" seribu \"),TRIM(BI12)),\"satu ratus\",\" seratus \"),\"satu puluh\",\" sepuluh \"))","v":""},null,null,null,null,null,null,null,null,null,null,null,null,null,null,null,null,null,null,null,null,null,null,null,null,null,null,null,null,null,null,null,null,null,null,null,null,null,null,null,null,null,null,null,null,null,null,null,null,null,null,"Tahap 2",{"$f":"TRIM(SUBSTITUTE(SUBSTITUTE(IF(DI8=1,SUBSTITUTE(TRIM(DI12),\"satu ribu\",\" seribu \"),TRIM(DI12)),\"satu ratus\",\" seratus \"),\"satu puluh\",\" sepuluh \"))","v":""},{"$f":"TRIM(SUBSTITUTE(SUBSTITUTE(IF(DJ8=1,SUBSTITUTE(TRIM(DJ12),\"satu ribu\",\" seribu \"),TRIM(DJ12)),\"satu ratus\",\" seratus \"),\"satu puluh\",\" sepuluh \"))","v":"lima juta"},{"$f":"TRIM(SUBSTITUTE(SUBSTITUTE(IF(DK8=1,SUBSTITUTE(TRIM(DK12),\"satu ribu\",\" seribu \"),TRIM(DK12)),\"satu ratus\",\" seratus \"),\"satu puluh\",\" sepuluh \"))","v":""},{"$f":"TRIM(SUBSTITUTE(SUBSTITUTE(IF(DL8=1,SUBSTITUTE(TRIM(DL12),\"satu ribu\",\" seribu \"),TRIM(DL12)),\"satu ratus\",\" seratus \"),\"satu puluh\",\" sepuluh \"))","v":""},null,null,null,null,null,null,null,null,null,null,null,null,null,null,null,null,null,null,null,null,null,null,null,null,null,null,null,null,null,null,null,null,null,null,null,null,null,null,null,null,null,null,null,null,null,null,null,null,null,null,"Tahap 2",{"$f":"TRIM(SUBSTITUTE(SUBSTITUTE(IF(FL8=1,SUBSTITUTE(TRIM(FL12),\"satu ribu\",\" seribu \"),TRIM(FL12)),\"satu ratus\",\" seratus \"),\"satu puluh\",\" sepuluh \"))","v":""},{"$f":"TRIM(SUBSTITUTE(SUBSTITUTE(IF(FM8=1,SUBSTITUTE(TRIM(FM12),\"satu ribu\",\" seribu \"),TRIM(FM12)),\"satu ratus\",\" seratus \"),\"satu puluh\",\" sepuluh \"))","v":"lima juta"},{"$f":"TRIM(SUBSTITUTE(SUBSTITUTE(IF(FN8=1,SUBSTITUTE(TRIM(FN12),\"satu ribu\",\" seribu \"),TRIM(FN12)),\"satu ratus\",\" seratus \"),\"satu puluh\",\" sepuluh \"))","v":""},{"$f":"TRIM(SUBSTITUTE(SUBSTITUTE(IF(FO8=1,SUBSTITUTE(TRIM(FO12),\"satu ribu\",\" seribu \"),TRIM(FO12)),\"satu ratus\",\" seratus \"),\"satu puluh\",\" sepuluh \"))","v":""},null,null,null,null,null,null,null,null,null,null,null,null,null,null,null,null,null,null,null,null,null,null,null,null,null,null,null,null,null,null,null,null,null,null,null,null,null,null,null,null,null,null,null,null,null,null,null,null,null,null,"Tahap 2",{"$f":"TRIM(SUBSTITUTE(SUBSTITUTE(IF(HO8=1,SUBSTITUTE(TRIM(HO12),\"satu ribu\",\" seribu \"),TRIM(HO12)),\"satu ratus\",\" seratus \"),\"satu puluh\",\" sepuluh \"))","v":""},{"$f":"TRIM(SUBSTITUTE(SUBSTITUTE(IF(HP8=1,SUBSTITUTE(TRIM(HP12),\"satu ribu\",\" seribu \"),TRIM(HP12)),\"satu ratus\",\" seratus \"),\"satu puluh\",\" sepuluh \"))","v":"lima juta"},{"$f":"TRIM(SUBSTITUTE(SUBSTITUTE(IF(HQ8=1,SUBSTITUTE(TRIM(HQ12),\"satu ribu\",\" seribu \"),TRIM(HQ12)),\"satu ratus\",\" seratus \"),\"satu puluh\",\" sepuluh \"))","v":""},{"$f":"TRIM(SUBSTITUTE(SUBSTITUTE(IF(HR8=1,SUBSTITUTE(TRIM(HR12),\"satu ribu\",\" seribu \"),TRIM(HR12)),\"satu ratus\",\" seratus \"),\"satu puluh\",\" sepuluh \"))","v":""},null,null,null,null,null,null,null,null,null,null,null,null,null,null,null,null,null,null,null,null,null,null,null,null,null,null,null,null,null,null,null,null,null,null,null,null,null,null,null,null,null,null,null,null,null,null,null,null,null,null,"Tahap 2",{"$f":"TRIM(SUBSTITUTE(SUBSTITUTE(IF(JR8=1,SUBSTITUTE(TRIM(JR12),\"satu ribu\",\" seribu \"),TRIM(JR12)),\"satu ratus\",\" seratus \"),\"satu puluh\",\" sepuluh \"))","v":""},{"$f":"TRIM(SUBSTITUTE(SUBSTITUTE(IF(JS8=1,SUBSTITUTE(TRIM(JS12),\"satu ribu\",\" seribu \"),TRIM(JS12)),\"satu ratus\",\" seratus \"),\"satu puluh\",\" sepuluh \"))","v":"lima juta"},{"$f":"TRIM(SUBSTITUTE(SUBSTITUTE(IF(JT8=1,SUBSTITUTE(TRIM(JT12),\"satu ribu\",\" seribu \"),TRIM(JT12)),\"satu ratus\",\" seratus \"),\"satu puluh\",\" sepuluh \"))","v":""},{"$f":"TRIM(SUBSTITUTE(SUBSTITUTE(IF(JU8=1,SUBSTITUTE(TRIM(JU12),\"satu ribu\",\" seribu \"),TRIM(JU12)),\"satu ratus\",\" seratus \"),\"satu puluh\",\" sepuluh \"))","v":""},null,null,null,null,null,null,null,null,null,null,null,null,null,null,null,null,null,null,null,null,null,null,null,null,null,null,null,null,null,null,null,null,null,null,null,null,null,null,null,null,null,null,null,null,null,null,null,null,null,null,"Tahap 2",{"$f":"TRIM(SUBSTITUTE(SUBSTITUTE(IF(LU8=1,SUBSTITUTE(TRIM(LU12),\"satu ribu\",\" seribu \"),TRIM(LU12)),\"satu ratus\",\" seratus \"),\"satu puluh\",\" sepuluh \"))","v":""},{"$f":"TRIM(SUBSTITUTE(SUBSTITUTE(IF(LV8=1,SUBSTITUTE(TRIM(LV12),\"satu ribu\",\" seribu \"),TRIM(LV12)),\"satu ratus\",\" seratus \"),\"satu puluh\",\" sepuluh \"))","v":"lima juta"},{"$f":"TRIM(SUBSTITUTE(SUBSTITUTE(IF(LW8=1,SUBSTITUTE(TRIM(LW12),\"satu ribu\",\" seribu \"),TRIM(LW12)),\"satu ratus\",\" seratus \"),\"satu puluh\",\" sepuluh \"))","v":""},{"$f":"TRIM(SUBSTITUTE(SUBSTITUTE(IF(LX8=1,SUBSTITUTE(TRIM(LX12),\"satu ribu\",\" seribu \"),TRIM(LX12)),\"satu ratus\",\" seratus \"),\"satu puluh\",\" sepuluh \"))","v":""},null,null,null,null,null,null,null,null,null,null,null,null,null,null,null,null,null,null,null,null,null,null,null,null,null,null,null,null,null,null,null,null,null,null,null,null,null,null,null,null,null,null,null,null,null,null,null,null,null,null,"Tahap 2",{"$f":"TRIM(SUBSTITUTE(SUBSTITUTE(IF(NX8=1,SUBSTITUTE(TRIM(NX12),\"satu ribu\",\" seribu \"),TRIM(NX12)),\"satu ratus\",\" seratus \"),\"satu puluh\",\" sepuluh \"))","v":""},{"$f":"TRIM(SUBSTITUTE(SUBSTITUTE(IF(NY8=1,SUBSTITUTE(TRIM(NY12),\"satu ribu\",\" seribu \"),TRIM(NY12)),\"satu ratus\",\" seratus \"),\"satu puluh\",\" sepuluh \"))","v":"lima juta"},{"$f":"TRIM(SUBSTITUTE(SUBSTITUTE(IF(NZ8=1,SUBSTITUTE(TRIM(NZ12),\"satu ribu\",\" seribu \"),TRIM(NZ12)),\"satu ratus\",\" seratus \"),\"satu puluh\",\" sepuluh \"))","v":""},{"$f":"TRIM(SUBSTITUTE(SUBSTITUTE(IF(OA8=1,SUBSTITUTE(TRIM(OA12),\"satu ribu\",\" seribu \"),TRIM(OA12)),\"satu ratus\",\" seratus \"),\"satu puluh\",\" sepuluh \"))","v":""},null,null,null,null,null,null,null,null,null,null,null,null,null,null,null,null,null,null,null,null,null,null,null,null,null,null,null,null,null,null,null,null,null,null,null,null,null,null,null,null,null,null,null,null,null,null,null,null,null,null,"Tahap 2",{"$f":"TRIM(SUBSTITUTE(SUBSTITUTE(IF(QA8=1,SUBSTITUTE(TRIM(QA12),\"satu ribu\",\" seribu \"),TRIM(QA12)),\"satu ratus\",\" seratus \"),\"satu puluh\",\" sepuluh \"))","v":""},{"$f":"TRIM(SUBSTITUTE(SUBSTITUTE(IF(QB8=1,SUBSTITUTE(TRIM(QB12),\"satu ribu\",\" seribu \"),TRIM(QB12)),\"satu ratus\",\" seratus \"),\"satu puluh\",\" sepuluh \"))","v":"enam juta"},{"$f":"TRIM(SUBSTITUTE(SUBSTITUTE(IF(QC8=1,SUBSTITUTE(TRIM(QC12),\"satu ribu\",\" seribu \"),TRIM(QC12)),\"satu ratus\",\" seratus \"),\"satu puluh\",\" sepuluh \"))","v":""},{"$f":"TRIM(SUBSTITUTE(SUBSTITUTE(IF(QD8=1,SUBSTITUTE(TRIM(QD12),\"satu ribu\",\" seribu \"),TRIM(QD12)),\"satu ratus\",\" seratus \"),\"satu puluh\",\" sepuluh \"))","v":""},null,null,null,null,null,null,null,null,null,null,null,null,null,null,null,null,null,null,null,null,null,null,null,null,null,null,null,null,null,null,null,null,null,null,null,null,null,null,null,null,null,null,null,null,null,null,null,null,null,null,"Tahap 2",{"$f":"TRIM(SUBSTITUTE(SUBSTITUTE(IF(SD8=1,SUBSTITUTE(TRIM(SD12),\"satu ribu\",\" seribu \"),TRIM(SD12)),\"satu ratus\",\" seratus \"),\"satu puluh\",\" sepuluh \"))","v":""},{"$f":"TRIM(SUBSTITUTE(SUBSTITUTE(IF(SE8=1,SUBSTITUTE(TRIM(SE12),\"satu ribu\",\" seribu \"),TRIM(SE12)),\"satu ratus\",\" seratus \"),\"satu puluh\",\" sepuluh \"))","v":"sembilan juta"},{"$f":"TRIM(SUBSTITUTE(SUBSTITUTE(IF(SF8=1,SUBSTITUTE(TRIM(SF12),\"satu ribu\",\" seribu \"),TRIM(SF12)),\"satu ratus\",\" seratus \"),\"satu puluh\",\" sepuluh \"))","v":""},{"$f":"TRIM(SUBSTITUTE(SUBSTITUTE(IF(SG8=1,SUBSTITUTE(TRIM(SG12),\"satu ribu\",\" seribu \"),TRIM(SG12)),\"satu ratus\",\" seratus \"),\"satu puluh\",\" sepuluh \"))","v":""}]
[]
[]
[]
[]
[]
[]
[]
[]
[]
[]
[]
[]
[]
[]
[]
[]
[]
[]
[]
[]
[]
[]
[]
[]
[]
[]
[]
[]
[]
[]
[]
[]
[]
[]
[]
[]
[]
[]
[]
[]
[]
[]
[]
[]
[]
[]
[]
[]
[]
[]
[]
[]
[]
[]
[]
[]
[]
[]
[]
[]
[]
[]
[]
[]
[]
[]
[]
[]
[]
[]
[]
[]
[]
[]
[]
[]
[]
[]
[]
[]
[]
[]
[]
[]
[]
[]
[]
[]
[]
[]
[]
[]
[]
[]
[]
[]
[]
[]
[]
[]
[null,"Nilai",{"$f":"IF(AND(B2002=0,B4002=0),Kwitansi_11,\"#\")","v":5000000},null,null,null,null,null,null,null,null,null,null,null,null,null,null,null,null,null,null,null,null,null,null,null,null,null,null,null,null,null,null,null,null,null,null,null,null,null,null,null,null,null,null,null,null,null,null,null,null,null,null,null,null,null,"Nilai",{"$f":"IF(AND(B2002=0,B4002=0),Kwitansi_12,\"#\")","v":10000000},null,null,null,null,null,null,null,null,null,null,null,null,null,null,null,null,null,null,null,null,null,null,null,null,null,null,null,null,null,null,null,null,null,null,null,null,null,null,null,null,null,null,null,null,null,null,null,null,null,null,null,null,null,"Nilai",{"$f":"IF(AND(B2002=0,B4002=0),Kwitansi_13,\"#\")","v":7500000},null,null,null,null,null,null,null,null,null,null,null,null,null,null,null,null,null,null,null,null,null,null,null,null,null,null,null,null,null,null,null,null,null,null,null,null,null,null,null,null,null,null,null,null,null,null,null,null,null,null,null,null,null,"Nilai",{"$f":"IF(AND(B2002=0,B4002=0),Kwitansi_14,\"#\")","v":6000000},null,null,null,null,null,null,null,null,null,null,null,null,null,null,null,null,null,null,null,null,null,null,null,null,null,null,null,null,null,null,null,null,null,null,null,null,null,null,null,null,null,null,null,null,null,null,null,null,null,null,null,null,null,"Nilai",{"$f":"IF(AND(B2002=0,B4002=0),Kwitansi_15,\"#\")","v":6000000},null,null,null,null,null,null,null,null,null,null,null,null,null,null,null,null,null,null,null,null,null,null,null,null,null,null,null,null,null,null,null,null,null,null,null,null,null,null,null,null,null,null,null,null,null,null,null,null,null,null,null,null,null,"Nilai",{"$f":"IF(AND(B2002=0,B4002=0),Kwitansi_16,\"#\")","v":8000000},null,null,null,null,null,null,null,null,null,null,null,null,null,null,null,null,null,null,null,null,null,null,null,null,null,null,null,null,null,null,null,null,null,null,null,null,null,null,null,null,null,null,null,null,null,null,null,null,null,null,null,null,null,"Nilai",{"$f":"IF(AND(B2002=0,B4002=0),Kwitansi_17,\"#\")","v":8000000},null,null,null,null,null,null,null,null,null,null,null,null,null,null,null,null,null,null,null,null,null,null,null,null,null,null,null,null,null,null,null,null,null,null,null,null,null,null,null,null,null,null,null,null,null,null,null,null,null,null,null,null,null,"Nilai",{"$f":"IF(AND(B2002=0,B4002=0),Kwitansi_18,\"#\")","v":7500000},null,null,null,null,null,null,null,null,null,null,null,null,null,null,null,null,null,null,null,null,null,null,null,null,null,null,null,null,null,null,null,null,null,null,null,null,null,null,null,null,null,null,null,null,null,null,null,null,null,null,null,null,null,"Nilai",{"$f":"IF(AND(B2002=0,B4002=0),Kwitansi_19,\"#\")","v":7500000},null,null,null,null,null,null,null,null,null,null,null,null,null,null,null,null,null,null,null,null,null,null,null,null,null,null,null,null,null,null,null,null,null,null,null,null,null,null,null,null,null,null,null,null,null,null,null,null,null,null,null,null,null,"Nilai",{"$f":"IF(AND(B2002=0,B4002=0),Kwitansi_20,\"#\")","v":7500000}]
[null,"Terbilang",{"$f":"TRIM(C125&\" \"&D125&\" \"&E125&\" \"&F125)","v":"lima juta"},null,null,null,null,null,null,null,null,null,null,null,null,null,null,null,null,null,null,null,null,null,null,null,null,null,null,null,null,null,null,null,null,null,null,null,null,null,null,null,null,null,null,null,null,null,null,null,null,null,null,null,null,null,"Terbilang",{"$f":"TRIM(BF125&\" \"&BG125&\" \"&BH125&\" \"&BI125)","v":"sepuluh juta"},null,null,null,null,null,null,null,null,null,null,null,null,null,null,null,null,null,null,null,null,null,null,null,null,null,null,null,null,null,null,null,null,null,null,null,null,null,null,null,null,null,null,null,null,null,null,null,null,null,null,null,null,null,"Terbilang",{"$f":"TRIM(DI125&\" \"&DJ125&\" \"&DK125&\" \"&DL125)","v":"tujuh juta lima ratus ribu"},null,null,null,null,null,null,null,null,null,null,null,null,null,null,null,null,null,null,null,null,null,null,null,null,null,null,null,null,null,null,null,null,null,null,null,null,null,null,null,null,null,null,null,null,null,null,null,null,null,null,null,null,null,"Terbilang",{"$f":"TRIM(FL125&\" \"&FM125&\" \"&FN125&\" \"&FO125)","v":"enam juta"},null,null,null,null,null,null,null,null,null,null,null,null,null,null,null,null,null,null,null,null,null,null,null,null,null,null,null,null,null,null,null,null,null,null,null,null,null,null,null,null,null,null,null,null,null,null,null,null,null,null,null,null,null,"Terbilang",{"$f":"TRIM(HO125&\" \"&HP125&\" \"&HQ125&\" \"&HR125)","v":"enam juta"},null,null,null,null,null,null,null,null,null,null,null,null,null,null,null,null,null,null,null,null,null,null,null,null,null,null,null,null,null,null,null,null,null,null,null,null,null,null,null,null,null,null,null,null,null,null,null,null,null,null,null,null,null,"Terbilang",{"$f":"TRIM(JR125&\" \"&JS125&\" \"&JT125&\" \"&JU125)","v":"delapan juta"},null,null,null,null,null,null,null,null,null,null,null,null,null,null,null,null,null,null,null,null,null,null,null,null,null,null,null,null,null,null,null,null,null,null,null,null,null,null,null,null,null,null,null,null,null,null,null,null,null,null,null,null,null,"Terbilang",{"$f":"TRIM(LU125&\" \"&LV125&\" \"&LW125&\" \"&LX125)","v":"delapan juta"},null,null,null,null,null,null,null,null,null,null,null,null,null,null,null,null,null,null,null,null,null,null,null,null,null,null,null,null,null,null,null,null,null,null,null,null,null,null,null,null,null,null,null,null,null,null,null,null,null,null,null,null,null,"Terbilang",{"$f":"TRIM(NX125&\" \"&NY125&\" \"&NZ125&\" \"&OA125)","v":"tujuh juta lima ratus ribu"},null,null,null,null,null,null,null,null,null,null,null,null,null,null,null,null,null,null,null,null,null,null,null,null,null,null,null,null,null,null,null,null,null,null,null,null,null,null,null,null,null,null,null,null,null,null,null,null,null,null,null,null,null,"Terbilang",{"$f":"TRIM(QA125&\" \"&QB125&\" \"&QC125&\" \"&QD125)","v":"tujuh juta lima ratus ribu"},null,null,null,null,null,null,null,null,null,null,null,null,null,null,null,null,null,null,null,null,null,null,null,null,null,null,null,null,null,null,null,null,null,null,null,null,null,null,null,null,null,null,null,null,null,null,null,null,null,null,null,null,null,"Terbilang",{"$f":"TRIM(SD125&\" \"&SE125&\" \"&SF125&\" \"&SG125)","v":"tujuh juta lima ratus ribu"}]
[]
[null," ","Milyar","Jutaan","Ratusan Ribu\ns.d. Ribuan","Ratusan \ns.d. Satuan",null,null,null,null,null,null,null,null,null,null,null,null,null,null,null,null,null,null,null,null,null,null,null,null,null,null,null,null,null,null,null,null,null,null,null,null,null,null,null,null,null,null,null,null,null,null,null,null,null,null," ","Milyar","Jutaan","Ratusan Ribu\ns.d. Ribuan","Ratusan \ns.d. Satuan",null,null,null,null,null,null,null,null,null,null,null,null,null,null,null,null,null,null,null,null,null,null,null,null,null,null,null,null,null,null,null,null,null,null,null,null,null,null,null,null,null,null,null,null,null,null,null,null,null,null," ","Milyar","Jutaan","Ratusan Ribu\ns.d. Ribuan","Ratusan \ns.d. Satuan",null,null,null,null,null,null,null,null,null,null,null,null,null,null,null,null,null,null,null,null,null,null,null,null,null,null,null,null,null,null,null,null,null,null,null,null,null,null,null,null,null,null,null,null,null,null,null,null,null,null," ","Milyar","Jutaan","Ratusan Ribu\ns.d. Ribuan","Ratusan \ns.d. Satuan",null,null,null,null,null,null,null,null,null,null,null,null,null,null,null,null,null,null,null,null,null,null,null,null,null,null,null,null,null,null,null,null,null,null,null,null,null,null,null,null,null,null,null,null,null,null,null,null,null,null," ","Milyar","Jutaan","Ratusan Ribu\ns.d. Ribuan","Ratusan \ns.d. Satuan",null,null,null,null,null,null,null,null,null,null,null,null,null,null,null,null,null,null,null,null,null,null,null,null,null,null,null,null,null,null,null,null,null,null,null,null,null,null,null,null,null,null,null,null,null,null,null,null,null,null," ","Milyar","Jutaan","Ratusan Ribu\ns.d. Ribuan","Ratusan \ns.d. Satuan",null,null,null,null,null,null,null,null,null,null,null,null,null,null,null,null,null,null,null,null,null,null,null,null,null,null,null,null,null,null,null,null,null,null,null,null,null,null,null,null,null,null,null,null,null,null,null,null,null,null," ","Milyar","Jutaan","Ratusan Ribu\ns.d. Ribuan","Ratusan \ns.d. Satuan",null,null,null,null,null,null,null,null,null,null,null,null,null,null,null,null,null,null,null,null,null,null,null,null,null,null,null,null,null,null,null,null,null,null,null,null,null,null,null,null,null,null,null,null,null,null,null,null,null,null," ","Milyar","Jutaan","Ratusan Ribu\ns.d. Ribuan","Ratusan \ns.d. Satuan",null,null,null,null,null,null,null,null,null,null,null,null,null,null,null,null,null,null,null,null,null,null,null,null,null,null,null,null,null,null,null,null,null,null,null,null,null,null,null,null,null,null,null,null,null,null,null,null,null,null," ","Milyar","Jutaan","Ratusan Ribu\ns.d. Ribuan","Ratusan \ns.d. Satuan",null,null,null,null,null,null,null,null,null,null,null,null,null,null,null,null,null,null,null,null,null,null,null,null,null,null,null,null,null,null,null,null,null,null,null,null,null,null,null,null,null,null,null,null,null,null,null,null,null,null," ","Milyar","Jutaan","Ratusan Ribu\ns.d. Ribuan","Ratusan \ns.d. Satuan"]
[null,"Posisi",1,4,7,10,null,null,null,null,null,null,null,null,null,null,null,null,null,null,null,null,null,null,null,null,null,null,null,null,null,null,null,null,null,null,null,null,null,null,null,null,null,null,null,null,null,null,null,null,null,null,null,null,null,null,"Posisi",1,4,7,10,null,null,null,null,null,null,null,null,null,null,null,null,null,null,null,null,null,null,null,null,null,null,null,null,null,null,null,null,null,null,null,null,null,null,null,null,null,null,null,null,null,null,null,null,null,null,null,null,null,null,"Posisi",1,4,7,10,null,null,null,null,null,null,null,null,null,null,null,null,null,null,null,null,null,null,null,null,null,null,null,null,null,null,null,null,null,null,null,null,null,null,null,null,null,null,null,null,null,null,null,null,null,null,null,null,null,null,"Posisi",1,4,7,10,null,null,null,null,null,null,null,null,null,null,null,null,null,null,null,null,null,null,null,null,null,null,null,null,null,null,null,null,null,null,null,null,null,null,null,null,null,null,null,null,null,null,null,null,null,null,null,null,null,null,"Posisi",1,4,7,10,null,null,null,null,null,null,null,null,null,null,null,null,null,null,null,null,null,null,null,null,null,null,null,null,null,null,null,null,null,null,null,null,null,null,null,null,null,null,null,null,null,null,null,null,null,null,null,null,null,null,"Posisi",1,4,7,10,null,null,null,null,null,null,null,null,null,null,null,null,null,null,null,null,null,null,null,null,null,null,null,null,null,null,null,null,null,null,null,null,null,null,null,null,null,null,null,null,null,null,null,null,null,null,null,null,null,null,"Posisi",1,4,7,10,null,null,null,null,null,null,null,null,null,null,null,null,null,null,null,null,null,null,null,null,null,null,null,null,null,null,null,null,null,null,null,null,null,null,null,null,null,null,null,null,null,null,null,null,null,null,null,null,null,null,"Posisi",1,4,7,10,null,null,null,null,null,null,null,null,null,null,null,null,null,null,null,null,null,null,null,null,null,null,null,null,null,null,null,null,null,null,null,null,null,null,null,null,null,null,null,null,null,null,null,null,null,null,null,null,null,null,"Posisi",1,4,7,10,null,null,null,null,null,null,null,null,null,null,null,null,null,null,null,null,null,null,null,null,null,null,null,null,null,null,null,null,null,null,null,null,null,null,null,null,null,null,null,null,null,null,null,null,null,null,null,null,null,null,"Posisi",1,4,7,10]
[null,"Digit",3,3,3,3,null,null,null,null,null,null,null,null,null,null,null,null,null,null,null,null,null,null,null,null,null,null,null,null,null,null,null,null,null,null,null,null,null,null,null,null,null,null,null,null,null,null,null,null,null,null,null,null,null,null,"Digit",3,3,3,3,null,null,null,null,null,null,null,null,null,null,null,null,null,null,null,null,null,null,null,null,null,null,null,null,null,null,null,null,null,null,null,null,null,null,null,null,null,null,null,null,null,null,null,null,null,null,null,null,null,null,"Digit",3,3,3,3,null,null,null,null,null,null,null,null,null,null,null,null,null,null,null,null,null,null,null,null,null,null,null,null,null,null,null,null,null,null,null,null,null,null,null,null,null,null,null,null,null,null,null,null,null,null,null,null,null,null,"Digit",3,3,3,3,null,null,null,null,null,null,null,null,null,null,null,null,null,null,null,null,null,null,null,null,null,null,null,null,null,null,null,null,null,null,null,null,null,null,null,null,null,null,null,null,null,null,null,null,null,null,null,null,null,null,"Digit",3,3,3,3,null,null,null,null,null,null,null,null,null,null,null,null,null,null,null,null,null,null,null,null,null,null,null,null,null,null,null,null,null,null,null,null,null,null,null,null,null,null,null,null,null,null,null,null,null,null,null,null,null,null,"Digit",3,3,3,3,null,null,null,null,null,null,null,null,null,null,null,null,null,null,null,null,null,null,null,null,null,null,null,null,null,null,null,null,null,null,null,null,null,null,null,null,null,null,null,null,null,null,null,null,null,null,null,null,null,null,"Digit",3,3,3,3,null,null,null,null,null,null,null,null,null,null,null,null,null,null,null,null,null,null,null,null,null,null,null,null,null,null,null,null,null,null,null,null,null,null,null,null,null,null,null,null,null,null,null,null,null,null,null,null,null,null,"Digit",3,3,3,3,null,null,null,null,null,null,null,null,null,null,null,null,null,null,null,null,null,null,null,null,null,null,null,null,null,null,null,null,null,null,null,null,null,null,null,null,null,null,null,null,null,null,null,null,null,null,null,null,null,null,"Digit",3,3,3,3,null,null,null,null,null,null,null,null,null,null,null,null,null,null,null,null,null,null,null,null,null,null,null,null,null,null,null,null,null,null,null,null,null,null,null,null,null,null,null,null,null,null,null,null,null,null,null,null,null,null,"Digit",3,3,3,3]
[null,"NILAI",{"$f":"--MID(TEXT(TRUNC(N($C$114),0),REPT(0,12)),C118,C119)","v":0},{"$f":"--MID(TEXT(TRUNC(N($C$114),0),REPT(0,12)),D118,D119)","v":5},{"$f":"--MID(TEXT(TRUNC(N($C$114),0),REPT(0,12)),E118,E119)","v":0},{"$f":"--MID(TEXT(TRUNC(N($C$114),0),REPT(0,12)),F118,F119)","v":0},null,null,null,null,null,null,null,null,null,null,null,null,null,null,null,null,null,null,null,null,null,null,null,null,null,null,null,null,null,null,null,null,null,null,null,null,null,null,null,null,null,null,null,null,null,null,null,null,null,null,"NILAI",{"$f":"--MID(TEXT(TRUNC(N($BF$114),0),REPT(0,12)),BF118,BF119)","v":0},{"$f":"--MID(TEXT(TRUNC(N($BF$114),0),REPT(0,12)),BG118,BG119)","v":10},{"$f":"--MID(TEXT(TRUNC(N($BF$114),0),REPT(0,12)),BH118,BH119)","v":0},{"$f":"--MID(TEXT(TRUNC(N($BF$114),0),REPT(0,12)),BI118,BI119)","v":0},null,null,null,null,null,null,null,null,null,null,null,null,null,null,null,null,null,null,null,null,null,null,null,null,null,null,null,null,null,null,null,null,null,null,null,null,null,null,null,null,null,null,null,null,null,null,null,null,null,null,"NILAI",{"$f":"--MID(TEXT(TRUNC(N($DI$114),0),REPT(0,12)),DI118,DI119)","v":0},{"$f":"--MID(TEXT(TRUNC(N($DI$114),0),REPT(0,12)),DJ118,DJ119)","v":7},{"$f":"--MID(TEXT(TRUNC(N($DI$114),0),REPT(0,12)),DK118,DK119)","v":500},{"$f":"--MID(TEXT(TRUNC(N($DI$114),0),REPT(0,12)),DL118,DL119)","v":0},null,null,null,null,null,null,null,null,null,null,null,null,null,null,null,null,null,null,null,null,null,null,null,null,null,null,null,null,null,null,null,null,null,null,null,null,null,null,null,null,null,null,null,null,null,null,null,null,null,null,"NILAI",{"$f":"--MID(TEXT(TRUNC(N($FL$114),0),REPT(0,12)),FL118,FL119)","v":0},{"$f":"--MID(TEXT(TRUNC(N($FL$114),0),REPT(0,12)),FM118,FM119)","v":6},{"$f":"--MID(TEXT(TRUNC(N($FL$114),0),REPT(0,12)),FN118,FN119)","v":0},{"$f":"--MID(TEXT(TRUNC(N($FL$114),0),REPT(0,12)),FO118,FO119)","v":0},null,null,null,null,null,null,null,null,null,null,null,null,null,null,null,null,null,null,null,null,null,null,null,null,null,null,null,null,null,null,null,null,null,null,null,null,null,null,null,null,null,null,null,null,null,null,null,null,null,null,"NILAI",{"$f":"--MID(TEXT(TRUNC(N($HO$114),0),REPT(0,12)),HO118,HO119)","v":0},{"$f":"--MID(TEXT(TRUNC(N($HO$114),0),REPT(0,12)),HP118,HP119)","v":6},{"$f":"--MID(TEXT(TRUNC(N($HO$114),0),REPT(0,12)),HQ118,HQ119)","v":0},{"$f":"--MID(TEXT(TRUNC(N($HO$114),0),REPT(0,12)),HR118,HR119)","v":0},null,null,null,null,null,null,null,null,null,null,null,null,null,null,null,null,null,null,null,null,null,null,null,null,null,null,null,null,null,null,null,null,null,null,null,null,null,null,null,null,null,null,null,null,null,null,null,null,null,null,"NILAI",{"$f":"--MID(TEXT(TRUNC(N($JR$114),0),REPT(0,12)),JR118,JR119)","v":0},{"$f":"--MID(TEXT(TRUNC(N($JR$114),0),REPT(0,12)),JS118,JS119)","v":8},{"$f":"--MID(TEXT(TRUNC(N($JR$114),0),REPT(0,12)),JT118,JT119)","v":0},{"$f":"--MID(TEXT(TRUNC(N($JR$114),0),REPT(0,12)),JU118,JU119)","v":0},null,null,null,null,null,null,null,null,null,null,null,null,null,null,null,null,null,null,null,null,null,null,null,null,null,null,null,null,null,null,null,null,null,null,null,null,null,null,null,null,null,null,null,null,null,null,null,null,null,null,"NILAI",{"$f":"--MID(TEXT(TRUNC(N($LU$114),0),REPT(0,12)),LU118,LU119)","v":0},{"$f":"--MID(TEXT(TRUNC(N($LU$114),0),REPT(0,12)),LV118,LV119)","v":8},{"$f":"--MID(TEXT(TRUNC(N($LU$114),0),REPT(0,12)),LW118,LW119)","v":0},{"$f":"--MID(TEXT(TRUNC(N($LU$114),0),REPT(0,12)),LX118,LX119)","v":0},null,null,null,null,null,null,null,null,null,null,null,null,null,null,null,null,null,null,null,null,null,null,null,null,null,null,null,null,null,null,null,null,null,null,null,null,null,null,null,null,null,null,null,null,null,null,null,null,null,null,"NILAI",{"$f":"--MID(TEXT(TRUNC(N($NX$114),0),REPT(0,12)),NX118,NX119)","v":0},{"$f":"--MID(TEXT(TRUNC(N($NX$114),0),REPT(0,12)),NY118,NY119)","v":7},{"$f":"--MID(TEXT(TRUNC(N($NX$114),0),REPT(0,12)),NZ118,NZ119)","v":500},{"$f":"--MID(TEXT(TRUNC(N($NX$114),0),REPT(0,12)),OA118,OA119)","v":0},null,null,null,null,null,null,null,null,null,null,null,null,null,null,null,null,null,null,null,null,null,null,null,null,null,null,null,null,null,null,null,null,null,null,null,null,null,null,null,null,null,null,null,null,null,null,null,null,null,null,"NILAI",{"$f":"--MID(TEXT(TRUNC(N($QA$114),0),REPT(0,12)),QA118,QA119)","v":0},{"$f":"--MID(TEXT(TRUNC(N($QA$114),0),REPT(0,12)),QB118,QB119)","v":7},{"$f":"--MID(TEXT(TRUNC(N($QA$114),0),REPT(0,12)),QC118,QC119)","v":500},{"$f":"--MID(TEXT(TRUNC(N($QA$114),0),REPT(0,12)),QD118,QD119)","v":0},null,null,null,null,null,null,null,null,null,null,null,null,null,null,null,null,null,null,null,null,null,null,null,null,null,null,null,null,null,null,null,null,null,null,null,null,null,null,null,null,null,null,null,null,null,null,null,null,null,null,"NILAI",{"$f":"--MID(TEXT(TRUNC(N($SD$114),0),REPT(0,12)),SD118,SD119)","v":0},{"$f":"--MID(TEXT(TRUNC(N($SD$114),0),REPT(0,12)),SE118,SE119)","v":7},{"$f":"--MID(TEXT(TRUNC(N($SD$114),0),REPT(0,12)),SF118,SF119)","v":500},{"$f":"--MID(TEXT(TRUNC(N($SD$114),0),REPT(0,12)),SG118,SG119)","v":0}]
[null,"Ratusan",{"$f":"N(\"Ambil angka Milyar\")+--MID(TEXT(N(C$120),REPT(0,3)),1,1)","v":0},{"$f":"--MID(TEXT(N(D$120),REPT(0,3)),1,1)","v":0},{"$f":"--MID(TEXT(N(E$120),REPT(0,3)),1,1)","v":0},{"$f":"--MID(TEXT(N(F$120),REPT(0,3)),1,1)","v":0},null,null,null,null,null,null,null,null,null,null,null,null,null,null,null,null,null,null,null,null,null,null,null,null,null,null,null,null,null,null,null,null,null,null,null,null,null,null,null,null,null,null,null,null,null,null,null,null,null,null,"Ratusan",{"$f":"N(\"Ambil angka Milyar\")+--MID(TEXT(N(BF$120),REPT(0,3)),1,1)","v":0},{"$f":"--MID(TEXT(N(BG$120),REPT(0,3)),1,1)","v":0},{"$f":"--MID(TEXT(N(BH$120),REPT(0,3)),1,1)","v":0},{"$f":"--MID(TEXT(N(BI$120),REPT(0,3)),1,1)","v":0},null,null,null,null,null,null,null,null,null,null,null,null,null,null,null,null,null,null,null,null,null,null,null,null,null,null,null,null,null,null,null,null,null,null,null,null,null,null,null,null,null,null,null,null,null,null,null,null,null,null,"Ratusan",{"$f":"N(\"Ambil angka Milyar\")+--MID(TEXT(N(DI$120),REPT(0,3)),1,1)","v":0},{"$f":"--MID(TEXT(N(DJ$120),REPT(0,3)),1,1)","v":0},{"$f":"--MID(TEXT(N(DK$120),REPT(0,3)),1,1)","v":5},{"$f":"--MID(TEXT(N(DL$120),REPT(0,3)),1,1)","v":0},null,null,null,null,null,null,null,null,null,null,null,null,null,null,null,null,null,null,null,null,null,null,null,null,null,null,null,null,null,null,null,null,null,null,null,null,null,null,null,null,null,null,null,null,null,null,null,null,null,null,"Ratusan",{"$f":"N(\"Ambil angka Milyar\")+--MID(TEXT(N(FL$120),REPT(0,3)),1,1)","v":0},{"$f":"--MID(TEXT(N(FM$120),REPT(0,3)),1,1)","v":0},{"$f":"--MID(TEXT(N(FN$120),REPT(0,3)),1,1)","v":0},{"$f":"--MID(TEXT(N(FO$120),REPT(0,3)),1,1)","v":0},null,null,null,null,null,null,null,null,null,null,null,null,null,null,null,null,null,null,null,null,null,null,null,null,null,null,null,null,null,null,null,null,null,null,null,null,null,null,null,null,null,null,null,null,null,null,null,null,null,null,"Ratusan",{"$f":"N(\"Ambil angka Milyar\")+--MID(TEXT(N(HO$120),REPT(0,3)),1,1)","v":0},{"$f":"--MID(TEXT(N(HP$120),REPT(0,3)),1,1)","v":0},{"$f":"--MID(TEXT(N(HQ$120),REPT(0,3)),1,1)","v":0},{"$f":"--MID(TEXT(N(HR$120),REPT(0,3)),1,1)","v":0},null,null,null,null,null,null,null,null,null,null,null,null,null,null,null,null,null,null,null,null,null,null,null,null,null,null,null,null,null,null,null,null,null,null,null,null,null,null,null,null,null,null,null,null,null,null,null,null,null,null,"Ratusan",{"$f":"N(\"Ambil angka Milyar\")+--MID(TEXT(N(JR$120),REPT(0,3)),1,1)","v":0},{"$f":"--MID(TEXT(N(JS$120),REPT(0,3)),1,1)","v":0},{"$f":"--MID(TEXT(N(JT$120),REPT(0,3)),1,1)","v":0},{"$f":"--MID(TEXT(N(JU$120),REPT(0,3)),1,1)","v":0},null,null,null,null,null,null,null,null,null,null,null,null,null,null,null,null,null,null,null,null,null,null,null,null,null,null,null,null,null,null,null,null,null,null,null,null,null,null,null,null,null,null,null,null,null,null,null,null,null,null,"Ratusan",{"$f":"N(\"Ambil angka Milyar\")+--MID(TEXT(N(LU$120),REPT(0,3)),1,1)","v":0},{"$f":"--MID(TEXT(N(LV$120),REPT(0,3)),1,1)","v":0},{"$f":"--MID(TEXT(N(LW$120),REPT(0,3)),1,1)","v":0},{"$f":"--MID(TEXT(N(LX$120),REPT(0,3)),1,1)","v":0},null,null,null,null,null,null,null,null,null,null,null,null,null,null,null,null,null,null,null,null,null,null,null,null,null,null,null,null,null,null,null,null,null,null,null,null,null,null,null,null,null,null,null,null,null,null,null,null,null,null,"Ratusan",{"$f":"N(\"Ambil angka Milyar\")+--MID(TEXT(N(NX$120),REPT(0,3)),1,1)","v":0},{"$f":"--MID(TEXT(N(NY$120),REPT(0,3)),1,1)","v":0},{"$f":"--MID(TEXT(N(NZ$120),REPT(0,3)),1,1)","v":5},{"$f":"--MID(TEXT(N(OA$120),REPT(0,3)),1,1)","v":0},null,null,null,null,null,null,null,null,null,null,null,null,null,null,null,null,null,null,null,null,null,null,null,null,null,null,null,null,null,null,null,null,null,null,null,null,null,null,null,null,null,null,null,null,null,null,null,null,null,null,"Ratusan",{"$f":"N(\"Ambil angka Milyar\")+--MID(TEXT(N(QA$120),REPT(0,3)),1,1)","v":0},{"$f":"--MID(TEXT(N(QB$120),REPT(0,3)),1,1)","v":0},{"$f":"--MID(TEXT(N(QC$120),REPT(0,3)),1,1)","v":5},{"$f":"--MID(TEXT(N(QD$120),REPT(0,3)),1,1)","v":0},null,null,null,null,null,null,null,null,null,null,null,null,null,null,null,null,null,null,null,null,null,null,null,null,null,null,null,null,null,null,null,null,null,null,null,null,null,null,null,null,null,null,null,null,null,null,null,null,null,null,"Ratusan",{"$f":"N(\"Ambil angka Milyar\")+--MID(TEXT(N(SD$120),REPT(0,3)),1,1)","v":0},{"$f":"--MID(TEXT(N(SE$120),REPT(0,3)),1,1)","v":0},{"$f":"--MID(TEXT(N(SF$120),REPT(0,3)),1,1)","v":5},{"$f":"--MID(TEXT(N(SG$120),REPT(0,3)),1,1)","v":0}]
[null,"Puluhan",{"$f":"N(\"Bila digit pertama angka puluhan > 1 MAKA hasilkan 1 digit angka depannya BILA TIDAK hasilkan Nol\")+IF(--MID(TEXT(N(C$120),REPT(0,3)),2,1)>1,--MID(TEXT(N(C$120),REPT(0,3)),2,1),0)","v":0},{"$f":"N(\"Bila digit pertama angka puluhan > 1 MAKA hasilkan 1 digit angka depannya BILA TIDAK hasilkan Nol\")+IF(--MID(TEXT(N(D$120),REPT(0,3)),2,1)>1,--MID(TEXT(N(D$120),REPT(0,3)),2,1),0)","v":0},{"$f":"N(\"Bila digit pertama angka puluhan > 1 MAKA hasilkan 1 digit angka depannya BILA TIDAK hasilkan Nol\")+IF(--MID(TEXT(N(E$120),REPT(0,3)),2,1)>1,--MID(TEXT(N(E$120),REPT(0,3)),2,1),0)","v":0},{"$f":"N(\"Bila digit pertama angka puluhan > 1 MAKA hasilkan 1 digit angka depannya BILA TIDAK hasilkan Nol\")+IF(--MID(TEXT(N(F$120),REPT(0,3)),2,1)>1,--MID(TEXT(N(F$120),REPT(0,3)),2,1),0)","v":0},null,null,null,null,null,null,null,null,null,null,null,null,null,null,null,null,null,null,null,null,null,null,null,null,null,null,null,null,null,null,null,null,null,null,null,null,null,null,null,null,null,null,null,null,null,null,null,null,null,null,"Puluhan",{"$f":"N(\"Bila digit pertama angka puluhan > 1 MAKA hasilkan 1 digit angka depannya BILA TIDAK hasilkan Nol\")+IF(--MID(TEXT(N(BF$120),REPT(0,3)),2,1)>1,--MID(TEXT(N(BF$120),REPT(0,3)),2,1),0)","v":0},{"$f":"N(\"Bila digit pertama angka puluhan > 1 MAKA hasilkan 1 digit angka depannya BILA TIDAK hasilkan Nol\")+IF(--MID(TEXT(N(BG$120),REPT(0,3)),2,1)>1,--MID(TEXT(N(BG$120),REPT(0,3)),2,1),0)","v":0},{"$f":"N(\"Bila digit pertama angka puluhan > 1 MAKA hasilkan 1 digit angka depannya BILA TIDAK hasilkan Nol\")+IF(--MID(TEXT(N(BH$120),REPT(0,3)),2,1)>1,--MID(TEXT(N(BH$120),REPT(0,3)),2,1),0)","v":0},{"$f":"N(\"Bila digit pertama angka puluhan > 1 MAKA hasilkan 1 digit angka depannya BILA TIDAK hasilkan Nol\")+IF(--MID(TEXT(N(BI$120),REPT(0,3)),2,1)>1,--MID(TEXT(N(BI$120),REPT(0,3)),2,1),0)","v":0},null,null,null,null,null,null,null,null,null,null,null,null,null,null,null,null,null,null,null,null,null,null,null,null,null,null,null,null,null,null,null,null,null,null,null,null,null,null,null,null,null,null,null,null,null,null,null,null,null,null,"Puluhan",{"$f":"N(\"Bila digit pertama angka puluhan > 1 MAKA hasilkan 1 digit angka depannya BILA TIDAK hasilkan Nol\")+IF(--MID(TEXT(N(DI$120),REPT(0,3)),2,1)>1,--MID(TEXT(N(DI$120),REPT(0,3)),2,1),0)","v":0},{"$f":"N(\"Bila digit pertama angka puluhan > 1 MAKA hasilkan 1 digit angka depannya BILA TIDAK hasilkan Nol\")+IF(--MID(TEXT(N(DJ$120),REPT(0,3)),2,1)>1,--MID(TEXT(N(DJ$120),REPT(0,3)),2,1),0)","v":0},{"$f":"N(\"Bila digit pertama angka puluhan > 1 MAKA hasilkan 1 digit angka depannya BILA TIDAK hasilkan Nol\")+IF(--MID(TEXT(N(DK$120),REPT(0,3)),2,1)>1,--MID(TEXT(N(DK$120),REPT(0,3)),2,1),0)","v":0},{"$f":"N(\"Bila digit pertama angka puluhan > 1 MAKA hasilkan 1 digit angka depannya BILA TIDAK hasilkan Nol\")+IF(--MID(TEXT(N(DL$120),REPT(0,3)),2,1)>1,--MID(TEXT(N(DL$120),REPT(0,3)),2,1),0)","v":0},null,null,null,null,null,null,null,null,null,null,null,null,null,null,null,null,null,null,null,null,null,null,null,null,null,null,null,null,null,null,null,null,null,null,null,null,null,null,null,null,null,null,null,null,null,null,null,null,null,null,"Puluhan",{"$f":"N(\"Bila digit pertama angka puluhan > 1 MAKA hasilkan 1 digit angka depannya BILA TIDAK hasilkan Nol\")+IF(--MID(TEXT(N(FL$120),REPT(0,3)),2,1)>1,--MID(TEXT(N(FL$120),REPT(0,3)),2,1),0)","v":0},{"$f":"N(\"Bila digit pertama angka puluhan > 1 MAKA hasilkan 1 digit angka depannya BILA TIDAK hasilkan Nol\")+IF(--MID(TEXT(N(FM$120),REPT(0,3)),2,1)>1,--MID(TEXT(N(FM$120),REPT(0,3)),2,1),0)","v":0},{"$f":"N(\"Bila digit pertama angka puluhan > 1 MAKA hasilkan 1 digit angka depannya BILA TIDAK hasilkan Nol\")+IF(--MID(TEXT(N(FN$120),REPT(0,3)),2,1)>1,--MID(TEXT(N(FN$120),REPT(0,3)),2,1),0)","v":0},{"$f":"N(\"Bila digit pertama angka puluhan > 1 MAKA hasilkan 1 digit angka depannya BILA TIDAK hasilkan Nol\")+IF(--MID(TEXT(N(FO$120),REPT(0,3)),2,1)>1,--MID(TEXT(N(FO$120),REPT(0,3)),2,1),0)","v":0},null,null,null,null,null,null,null,null,null,null,null,null,null,null,null,null,null,null,null,null,null,null,null,null,null,null,null,null,null,null,null,null,null,null,null,null,null,null,null,null,null,null,null,null,null,null,null,null,null,null,"Puluhan",{"$f":"N(\"Bila digit pertama angka puluhan > 1 MAKA hasilkan 1 digit angka depannya BILA TIDAK hasilkan Nol\")+IF(--MID(TEXT(N(HO$120),REPT(0,3)),2,1)>1,--MID(TEXT(N(HO$120),REPT(0,3)),2,1),0)","v":0},{"$f":"N(\"Bila digit pertama angka puluhan > 1 MAKA hasilkan 1 digit angka depannya BILA TIDAK hasilkan Nol\")+IF(--MID(TEXT(N(HP$120),REPT(0,3)),2,1)>1,--MID(TEXT(N(HP$120),REPT(0,3)),2,1),0)","v":0},{"$f":"N(\"Bila digit pertama angka puluhan > 1 MAKA hasilkan 1 digit angka depannya BILA TIDAK hasilkan Nol\")+IF(--MID(TEXT(N(HQ$120),REPT(0,3)),2,1)>1,--MID(TEXT(N(HQ$120),REPT(0,3)),2,1),0)","v":0},{"$f":"N(\"Bila digit pertama angka puluhan > 1 MAKA hasilkan 1 digit angka depannya BILA TIDAK hasilkan Nol\")+IF(--MID(TEXT(N(HR$120),REPT(0,3)),2,1)>1,--MID(TEXT(N(HR$120),REPT(0,3)),2,1),0)","v":0},null,null,null,null,null,null,null,null,null,null,null,null,null,null,null,null,null,null,null,null,null,null,null,null,null,null,null,null,null,null,null,null,null,null,null,null,null,null,null,null,null,null,null,null,null,null,null,null,null,null,"Puluhan",{"$f":"N(\"Bila digit pertama angka puluhan > 1 MAKA hasilkan 1 digit angka depannya BILA TIDAK hasilkan Nol\")+IF(--MID(TEXT(N(JR$120),REPT(0,3)),2,1)>1,--MID(TEXT(N(JR$120),REPT(0,3)),2,1),0)","v":0},{"$f":"N(\"Bila digit pertama angka puluhan > 1 MAKA hasilkan 1 digit angka depannya BILA TIDAK hasilkan Nol\")+IF(--MID(TEXT(N(JS$120),REPT(0,3)),2,1)>1,--MID(TEXT(N(JS$120),REPT(0,3)),2,1),0)","v":0},{"$f":"N(\"Bila digit pertama angka puluhan > 1 MAKA hasilkan 1 digit angka depannya BILA TIDAK hasilkan Nol\")+IF(--MID(TEXT(N(JT$120),REPT(0,3)),2,1)>1,--MID(TEXT(N(JT$120),REPT(0,3)),2,1),0)","v":0},{"$f":"N(\"Bila digit pertama angka puluhan > 1 MAKA hasilkan 1 digit angka depannya BILA TIDAK hasilkan Nol\")+IF(--MID(TEXT(N(JU$120),REPT(0,3)),2,1)>1,--MID(TEXT(N(JU$120),REPT(0,3)),2,1),0)","v":0},null,null,null,null,null,null,null,null,null,null,null,null,null,null,null,null,null,null,null,null,null,null,null,null,null,null,null,null,null,null,null,null,null,null,null,null,null,null,null,null,null,null,null,null,null,null,null,null,null,null,"Puluhan",{"$f":"N(\"Bila digit pertama angka puluhan > 1 MAKA hasilkan 1 digit angka depannya BILA TIDAK hasilkan Nol\")+IF(--MID(TEXT(N(LU$120),REPT(0,3)),2,1)>1,--MID(TEXT(N(LU$120),REPT(0,3)),2,1),0)","v":0},{"$f":"N(\"Bila digit pertama angka puluhan > 1 MAKA hasilkan 1 digit angka depannya BILA TIDAK hasilkan Nol\")+IF(--MID(TEXT(N(LV$120),REPT(0,3)),2,1)>1,--MID(TEXT(N(LV$120),REPT(0,3)),2,1),0)","v":0},{"$f":"N(\"Bila digit pertama angka puluhan > 1 MAKA hasilkan 1 digit angka depannya BILA TIDAK hasilkan Nol\")+IF(--MID(TEXT(N(LW$120),REPT(0,3)),2,1)>1,--MID(TEXT(N(LW$120),REPT(0,3)),2,1),0)","v":0},{"$f":"N(\"Bila digit pertama angka puluhan > 1 MAKA hasilkan 1 digit angka depannya BILA TIDAK hasilkan Nol\")+IF(--MID(TEXT(N(LX$120),REPT(0,3)),2,1)>1,--MID(TEXT(N(LX$120),REPT(0,3)),2,1),0)","v":0},null,null,null,null,null,null,null,null,null,null,null,null,null,null,null,null,null,null,null,null,null,null,null,null,null,null,null,null,null,null,null,null,null,null,null,null,null,null,null,null,null,null,null,null,null,null,null,null,null,null,"Puluhan",{"$f":"N(\"Bila digit pertama angka puluhan > 1 MAKA hasilkan 1 digit angka depannya BILA TIDAK hasilkan Nol\")+IF(--MID(TEXT(N(NX$120),REPT(0,3)),2,1)>1,--MID(TEXT(N(NX$120),REPT(0,3)),2,1),0)","v":0},{"$f":"N(\"Bila digit pertama angka puluhan > 1 MAKA hasilkan 1 digit angka depannya BILA TIDAK hasilkan Nol\")+IF(--MID(TEXT(N(NY$120),REPT(0,3)),2,1)>1,--MID(TEXT(N(NY$120),REPT(0,3)),2,1),0)","v":0},{"$f":"N(\"Bila digit pertama angka puluhan > 1 MAKA hasilkan 1 digit angka depannya BILA TIDAK hasilkan Nol\")+IF(--MID(TEXT(N(NZ$120),REPT(0,3)),2,1)>1,--MID(TEXT(N(NZ$120),REPT(0,3)),2,1),0)","v":0},{"$f":"N(\"Bila digit pertama angka puluhan > 1 MAKA hasilkan 1 digit angka depannya BILA TIDAK hasilkan Nol\")+IF(--MID(TEXT(N(OA$120),REPT(0,3)),2,1)>1,--MID(TEXT(N(OA$120),REPT(0,3)),2,1),0)","v":0},null,null,null,null,null,null,null,null,null,null,null,null,null,null,null,null,null,null,null,null,null,null,null,null,null,null,null,null,null,null,null,null,null,null,null,null,null,null,null,null,null,null,null,null,null,null,null,null,null,null,"Puluhan",{"$f":"N(\"Bila digit pertama angka puluhan > 1 MAKA hasilkan 1 digit angka depannya BILA TIDAK hasilkan Nol\")+IF(--MID(TEXT(N(QA$120),REPT(0,3)),2,1)>1,--MID(TEXT(N(QA$120),REPT(0,3)),2,1),0)","v":0},{"$f":"N(\"Bila digit pertama angka puluhan > 1 MAKA hasilkan 1 digit angka depannya BILA TIDAK hasilkan Nol\")+IF(--MID(TEXT(N(QB$120),REPT(0,3)),2,1)>1,--MID(TEXT(N(QB$120),REPT(0,3)),2,1),0)","v":0},{"$f":"N(\"Bila digit pertama angka puluhan > 1 MAKA hasilkan 1 digit angka depannya BILA TIDAK hasilkan Nol\")+IF(--MID(TEXT(N(QC$120),REPT(0,3)),2,1)>1,--MID(TEXT(N(QC$120),REPT(0,3)),2,1),0)","v":0},{"$f":"N(\"Bila digit pertama angka puluhan > 1 MAKA hasilkan 1 digit angka depannya BILA TIDAK hasilkan Nol\")+IF(--MID(TEXT(N(QD$120),REPT(0,3)),2,1)>1,--MID(TEXT(N(QD$120),REPT(0,3)),2,1),0)","v":0},null,null,null,null,null,null,null,null,null,null,null,null,null,null,null,null,null,null,null,null,null,null,null,null,null,null,null,null,null,null,null,null,null,null,null,null,null,null,null,null,null,null,null,null,null,null,null,null,null,null,"Puluhan",{"$f":"N(\"Bila digit pertama angka puluhan > 1 MAKA hasilkan 1 digit angka depannya BILA TIDAK hasilkan Nol\")+IF(--MID(TEXT(N(SD$120),REPT(0,3)),2,1)>1,--MID(TEXT(N(SD$120),REPT(0,3)),2,1),0)","v":0},{"$f":"N(\"Bila digit pertama angka puluhan > 1 MAKA hasilkan 1 digit angka depannya BILA TIDAK hasilkan Nol\")+IF(--MID(TEXT(N(SE$120),REPT(0,3)),2,1)>1,--MID(TEXT(N(SE$120),REPT(0,3)),2,1),0)","v":0},{"$f":"N(\"Bila digit pertama angka puluhan > 1 MAKA hasilkan 1 digit angka depannya BILA TIDAK hasilkan Nol\")+IF(--MID(TEXT(N(SF$120),REPT(0,3)),2,1)>1,--MID(TEXT(N(SF$120),REPT(0,3)),2,1),0)","v":0},{"$f":"N(\"Bila digit pertama angka puluhan > 1 MAKA hasilkan 1 digit angka depannya BILA TIDAK hasilkan Nol\")+IF(--MID(TEXT(N(SG$120),REPT(0,3)),2,1)>1,--MID(TEXT(N(SG$120),REPT(0,3)),2,1),0)","v":0}]
[null,"Belasan & Satuan",{"$f":"N(\"Bila 2 digit terakhir > 19 MAKA hasilkan 1 digit terakhir BILA TIDAK hasilkan 2 digit terakhir\")+IF(--MID(TEXT(N(C$120),REPT(0,3)),2,2)>19,--MID(TEXT(N(C$120),REPT(0,3)),3,1),--MID(TEXT(N(C$120),REPT(0,3)),2,2))","v":0},{"$f":"N(\"Bila 2 digit terakhir > 19 MAKA hasilkan 1 digit terakhir BILA TIDAK hasilkan 2 digit terakhir\")+IF(--MID(TEXT(N(D$120),REPT(0,3)),2,2)>19,--MID(TEXT(N(D$120),REPT(0,3)),3,1),--MID(TEXT(N(D$120),REPT(0,3)),2,2))","v":5},{"$f":"N(\"Bila 2 digit terakhir > 19 MAKA hasilkan 1 digit terakhir BILA TIDAK hasilkan 2 digit terakhir\")+IF(--MID(TEXT(N(E$120),REPT(0,3)),2,2)>19,--MID(TEXT(N(E$120),REPT(0,3)),3,1),--MID(TEXT(N(E$120),REPT(0,3)),2,2))","v":0},{"$f":"N(\"Bila 2 digit terakhir > 19 MAKA hasilkan 1 digit terakhir BILA TIDAK hasilkan 2 digit terakhir\")+IF(--MID(TEXT(N(F$120),REPT(0,3)),2,2)>19,--MID(TEXT(N(F$120),REPT(0,3)),3,1),--MID(TEXT(N(F$120),REPT(0,3)),2,2))","v":0},null,null,null,null,null,null,null,null,null,null,null,null,null,null,null,null,null,null,null,null,null,null,null,null,null,null,null,null,null,null,null,null,null,null,null,null,null,null,null,null,null,null,null,null,null,null,null,null,null,null,"Belasan & Satuan",{"$f":"N(\"Bila 2 digit terakhir > 19 MAKA hasilkan 1 digit terakhir BILA TIDAK hasilkan 2 digit terakhir\")+IF(--MID(TEXT(N(BF$120),REPT(0,3)),2,2)>19,--MID(TEXT(N(BF$120),REPT(0,3)),3,1),--MID(TEXT(N(BF$120),REPT(0,3)),2,2))","v":0},{"$f":"N(\"Bila 2 digit terakhir > 19 MAKA hasilkan 1 digit terakhir BILA TIDAK hasilkan 2 digit terakhir\")+IF(--MID(TEXT(N(BG$120),REPT(0,3)),2,2)>19,--MID(TEXT(N(BG$120),REPT(0,3)),3,1),--MID(TEXT(N(BG$120),REPT(0,3)),2,2))","v":10},{"$f":"N(\"Bila 2 digit terakhir > 19 MAKA hasilkan 1 digit terakhir BILA TIDAK hasilkan 2 digit terakhir\")+IF(--MID(TEXT(N(BH$120),REPT(0,3)),2,2)>19,--MID(TEXT(N(BH$120),REPT(0,3)),3,1),--MID(TEXT(N(BH$120),REPT(0,3)),2,2))","v":0},{"$f":"N(\"Bila 2 digit terakhir > 19 MAKA hasilkan 1 digit terakhir BILA TIDAK hasilkan 2 digit terakhir\")+IF(--MID(TEXT(N(BI$120),REPT(0,3)),2,2)>19,--MID(TEXT(N(BI$120),REPT(0,3)),3,1),--MID(TEXT(N(BI$120),REPT(0,3)),2,2))","v":0},null,null,null,null,null,null,null,null,null,null,null,null,null,null,null,null,null,null,null,null,null,null,null,null,null,null,null,null,null,null,null,null,null,null,null,null,null,null,null,null,null,null,null,null,null,null,null,null,null,null,"Belasan & Satuan",{"$f":"N(\"Bila 2 digit terakhir > 19 MAKA hasilkan 1 digit terakhir BILA TIDAK hasilkan 2 digit terakhir\")+IF(--MID(TEXT(N(DI$120),REPT(0,3)),2,2)>19,--MID(TEXT(N(DI$120),REPT(0,3)),3,1),--MID(TEXT(N(DI$120),REPT(0,3)),2,2))","v":0},{"$f":"N(\"Bila 2 digit terakhir > 19 MAKA hasilkan 1 digit terakhir BILA TIDAK hasilkan 2 digit terakhir\")+IF(--MID(TEXT(N(DJ$120),REPT(0,3)),2,2)>19,--MID(TEXT(N(DJ$120),REPT(0,3)),3,1),--MID(TEXT(N(DJ$120),REPT(0,3)),2,2))","v":7},{"$f":"N(\"Bila 2 digit terakhir > 19 MAKA hasilkan 1 digit terakhir BILA TIDAK hasilkan 2 digit terakhir\")+IF(--MID(TEXT(N(DK$120),REPT(0,3)),2,2)>19,--MID(TEXT(N(DK$120),REPT(0,3)),3,1),--MID(TEXT(N(DK$120),REPT(0,3)),2,2))","v":0},{"$f":"N(\"Bila 2 digit terakhir > 19 MAKA hasilkan 1 digit terakhir BILA TIDAK hasilkan 2 digit terakhir\")+IF(--MID(TEXT(N(DL$120),REPT(0,3)),2,2)>19,--MID(TEXT(N(DL$120),REPT(0,3)),3,1),--MID(TEXT(N(DL$120),REPT(0,3)),2,2))","v":0},null,null,null,null,null,null,null,null,null,null,null,null,null,null,null,null,null,null,null,null,null,null,null,null,null,null,null,null,null,null,null,null,null,null,null,null,null,null,null,null,null,null,null,null,null,null,null,null,null,null,"Belasan & Satuan",{"$f":"N(\"Bila 2 digit terakhir > 19 MAKA hasilkan 1 digit terakhir BILA TIDAK hasilkan 2 digit terakhir\")+IF(--MID(TEXT(N(FL$120),REPT(0,3)),2,2)>19,--MID(TEXT(N(FL$120),REPT(0,3)),3,1),--MID(TEXT(N(FL$120),REPT(0,3)),2,2))","v":0},{"$f":"N(\"Bila 2 digit terakhir > 19 MAKA hasilkan 1 digit terakhir BILA TIDAK hasilkan 2 digit terakhir\")+IF(--MID(TEXT(N(FM$120),REPT(0,3)),2,2)>19,--MID(TEXT(N(FM$120),REPT(0,3)),3,1),--MID(TEXT(N(FM$120),REPT(0,3)),2,2))","v":6},{"$f":"N(\"Bila 2 digit terakhir > 19 MAKA hasilkan 1 digit terakhir BILA TIDAK hasilkan 2 digit terakhir\")+IF(--MID(TEXT(N(FN$120),REPT(0,3)),2,2)>19,--MID(TEXT(N(FN$120),REPT(0,3)),3,1),--MID(TEXT(N(FN$120),REPT(0,3)),2,2))","v":0},{"$f":"N(\"Bila 2 digit terakhir > 19 MAKA hasilkan 1 digit terakhir BILA TIDAK hasilkan 2 digit terakhir\")+IF(--MID(TEXT(N(FO$120),REPT(0,3)),2,2)>19,--MID(TEXT(N(FO$120),REPT(0,3)),3,1),--MID(TEXT(N(FO$120),REPT(0,3)),2,2))","v":0},null,null,null,null,null,null,null,null,null,null,null,null,null,null,null,null,null,null,null,null,null,null,null,null,null,null,null,null,null,null,null,null,null,null,null,null,null,null,null,null,null,null,null,null,null,null,null,null,null,null,"Belasan & Satuan",{"$f":"N(\"Bila 2 digit terakhir > 19 MAKA hasilkan 1 digit terakhir BILA TIDAK hasilkan 2 digit terakhir\")+IF(--MID(TEXT(N(HO$120),REPT(0,3)),2,2)>19,--MID(TEXT(N(HO$120),REPT(0,3)),3,1),--MID(TEXT(N(HO$120),REPT(0,3)),2,2))","v":0},{"$f":"N(\"Bila 2 digit terakhir > 19 MAKA hasilkan 1 digit terakhir BILA TIDAK hasilkan 2 digit terakhir\")+IF(--MID(TEXT(N(HP$120),REPT(0,3)),2,2)>19,--MID(TEXT(N(HP$120),REPT(0,3)),3,1),--MID(TEXT(N(HP$120),REPT(0,3)),2,2))","v":6},{"$f":"N(\"Bila 2 digit terakhir > 19 MAKA hasilkan 1 digit terakhir BILA TIDAK hasilkan 2 digit terakhir\")+IF(--MID(TEXT(N(HQ$120),REPT(0,3)),2,2)>19,--MID(TEXT(N(HQ$120),REPT(0,3)),3,1),--MID(TEXT(N(HQ$120),REPT(0,3)),2,2))","v":0},{"$f":"N(\"Bila 2 digit terakhir > 19 MAKA hasilkan 1 digit terakhir BILA TIDAK hasilkan 2 digit terakhir\")+IF(--MID(TEXT(N(HR$120),REPT(0,3)),2,2)>19,--MID(TEXT(N(HR$120),REPT(0,3)),3,1),--MID(TEXT(N(HR$120),REPT(0,3)),2,2))","v":0},null,null,null,null,null,null,null,null,null,null,null,null,null,null,null,null,null,null,null,null,null,null,null,null,null,null,null,null,null,null,null,null,null,null,null,null,null,null,null,null,null,null,null,null,null,null,null,null,null,null,"Belasan & Satuan",{"$f":"N(\"Bila 2 digit terakhir > 19 MAKA hasilkan 1 digit terakhir BILA TIDAK hasilkan 2 digit terakhir\")+IF(--MID(TEXT(N(JR$120),REPT(0,3)),2,2)>19,--MID(TEXT(N(JR$120),REPT(0,3)),3,1),--MID(TEXT(N(JR$120),REPT(0,3)),2,2))","v":0},{"$f":"N(\"Bila 2 digit terakhir > 19 MAKA hasilkan 1 digit terakhir BILA TIDAK hasilkan 2 digit terakhir\")+IF(--MID(TEXT(N(JS$120),REPT(0,3)),2,2)>19,--MID(TEXT(N(JS$120),REPT(0,3)),3,1),--MID(TEXT(N(JS$120),REPT(0,3)),2,2))","v":8},{"$f":"N(\"Bila 2 digit terakhir > 19 MAKA hasilkan 1 digit terakhir BILA TIDAK hasilkan 2 digit terakhir\")+IF(--MID(TEXT(N(JT$120),REPT(0,3)),2,2)>19,--MID(TEXT(N(JT$120),REPT(0,3)),3,1),--MID(TEXT(N(JT$120),REPT(0,3)),2,2))","v":0},{"$f":"N(\"Bila 2 digit terakhir > 19 MAKA hasilkan 1 digit terakhir BILA TIDAK hasilkan 2 digit terakhir\")+IF(--MID(TEXT(N(JU$120),REPT(0,3)),2,2)>19,--MID(TEXT(N(JU$120),REPT(0,3)),3,1),--MID(TEXT(N(JU$120),REPT(0,3)),2,2))","v":0},null,null,null,null,null,null,null,null,null,null,null,null,null,null,null,null,null,null,null,null,null,null,null,null,null,null,null,null,null,null,null,null,null,null,null,null,null,null,null,null,null,null,null,null,null,null,null,null,null,null,"Belasan & Satuan",{"$f":"N(\"Bila 2 digit terakhir > 19 MAKA hasilkan 1 digit terakhir BILA TIDAK hasilkan 2 digit terakhir\")+IF(--MID(TEXT(N(LU$120),REPT(0,3)),2,2)>19,--MID(TEXT(N(LU$120),REPT(0,3)),3,1),--MID(TEXT(N(LU$120),REPT(0,3)),2,2))","v":0},{"$f":"N(\"Bila 2 digit terakhir > 19 MAKA hasilkan 1 digit terakhir BILA TIDAK hasilkan 2 digit terakhir\")+IF(--MID(TEXT(N(LV$120),REPT(0,3)),2,2)>19,--MID(TEXT(N(LV$120),REPT(0,3)),3,1),--MID(TEXT(N(LV$120),REPT(0,3)),2,2))","v":8},{"$f":"N(\"Bila 2 digit terakhir > 19 MAKA hasilkan 1 digit terakhir BILA TIDAK hasilkan 2 digit terakhir\")+IF(--MID(TEXT(N(LW$120),REPT(0,3)),2,2)>19,--MID(TEXT(N(LW$120),REPT(0,3)),3,1),--MID(TEXT(N(LW$120),REPT(0,3)),2,2))","v":0},{"$f":"N(\"Bila 2 digit terakhir > 19 MAKA hasilkan 1 digit terakhir BILA TIDAK hasilkan 2 digit terakhir\")+IF(--MID(TEXT(N(LX$120),REPT(0,3)),2,2)>19,--MID(TEXT(N(LX$120),REPT(0,3)),3,1),--MID(TEXT(N(LX$120),REPT(0,3)),2,2))","v":0},null,null,null,null,null,null,null,null,null,null,null,null,null,null,null,null,null,null,null,null,null,null,null,null,null,null,null,null,null,null,null,null,null,null,null,null,null,null,null,null,null,null,null,null,null,null,null,null,null,null,"Belasan & Satuan",{"$f":"N(\"Bila 2 digit terakhir > 19 MAKA hasilkan 1 digit terakhir BILA TIDAK hasilkan 2 digit terakhir\")+IF(--MID(TEXT(N(NX$120),REPT(0,3)),2,2)>19,--MID(TEXT(N(NX$120),REPT(0,3)),3,1),--MID(TEXT(N(NX$120),REPT(0,3)),2,2))","v":0},{"$f":"N(\"Bila 2 digit terakhir > 19 MAKA hasilkan 1 digit terakhir BILA TIDAK hasilkan 2 digit terakhir\")+IF(--MID(TEXT(N(NY$120),REPT(0,3)),2,2)>19,--MID(TEXT(N(NY$120),REPT(0,3)),3,1),--MID(TEXT(N(NY$120),REPT(0,3)),2,2))","v":7},{"$f":"N(\"Bila 2 digit terakhir > 19 MAKA hasilkan 1 digit terakhir BILA TIDAK hasilkan 2 digit terakhir\")+IF(--MID(TEXT(N(NZ$120),REPT(0,3)),2,2)>19,--MID(TEXT(N(NZ$120),REPT(0,3)),3,1),--MID(TEXT(N(NZ$120),REPT(0,3)),2,2))","v":0},{"$f":"N(\"Bila 2 digit terakhir > 19 MAKA hasilkan 1 digit terakhir BILA TIDAK hasilkan 2 digit terakhir\")+IF(--MID(TEXT(N(OA$120),REPT(0,3)),2,2)>19,--MID(TEXT(N(OA$120),REPT(0,3)),3,1),--MID(TEXT(N(OA$120),REPT(0,3)),2,2))","v":0},null,null,null,null,null,null,null,null,null,null,null,null,null,null,null,null,null,null,null,null,null,null,null,null,null,null,null,null,null,null,null,null,null,null,null,null,null,null,null,null,null,null,null,null,null,null,null,null,null,null,"Belasan & Satuan",{"$f":"N(\"Bila 2 digit terakhir > 19 MAKA hasilkan 1 digit terakhir BILA TIDAK hasilkan 2 digit terakhir\")+IF(--MID(TEXT(N(QA$120),REPT(0,3)),2,2)>19,--MID(TEXT(N(QA$120),REPT(0,3)),3,1),--MID(TEXT(N(QA$120),REPT(0,3)),2,2))","v":0},{"$f":"N(\"Bila 2 digit terakhir > 19 MAKA hasilkan 1 digit terakhir BILA TIDAK hasilkan 2 digit terakhir\")+IF(--MID(TEXT(N(QB$120),REPT(0,3)),2,2)>19,--MID(TEXT(N(QB$120),REPT(0,3)),3,1),--MID(TEXT(N(QB$120),REPT(0,3)),2,2))","v":7},{"$f":"N(\"Bila 2 digit terakhir > 19 MAKA hasilkan 1 digit terakhir BILA TIDAK hasilkan 2 digit terakhir\")+IF(--MID(TEXT(N(QC$120),REPT(0,3)),2,2)>19,--MID(TEXT(N(QC$120),REPT(0,3)),3,1),--MID(TEXT(N(QC$120),REPT(0,3)),2,2))","v":0},{"$f":"N(\"Bila 2 digit terakhir > 19 MAKA hasilkan 1 digit terakhir BILA TIDAK hasilkan 2 digit terakhir\")+IF(--MID(TEXT(N(QD$120),REPT(0,3)),2,2)>19,--MID(TEXT(N(QD$120),REPT(0,3)),3,1),--MID(TEXT(N(QD$120),REPT(0,3)),2,2))","v":0},null,null,null,null,null,null,null,null,null,null,null,null,null,null,null,null,null,null,null,null,null,null,null,null,null,null,null,null,null,null,null,null,null,null,null,null,null,null,null,null,null,null,null,null,null,null,null,null,null,null,"Belasan & Satuan",{"$f":"N(\"Bila 2 digit terakhir > 19 MAKA hasilkan 1 digit terakhir BILA TIDAK hasilkan 2 digit terakhir\")+IF(--MID(TEXT(N(SD$120),REPT(0,3)),2,2)>19,--MID(TEXT(N(SD$120),REPT(0,3)),3,1),--MID(TEXT(N(SD$120),REPT(0,3)),2,2))","v":0},{"$f":"N(\"Bila 2 digit terakhir > 19 MAKA hasilkan 1 digit terakhir BILA TIDAK hasilkan 2 digit terakhir\")+IF(--MID(TEXT(N(SE$120),REPT(0,3)),2,2)>19,--MID(TEXT(N(SE$120),REPT(0,3)),3,1),--MID(TEXT(N(SE$120),REPT(0,3)),2,2))","v":7},{"$f":"N(\"Bila 2 digit terakhir > 19 MAKA hasilkan 1 digit terakhir BILA TIDAK hasilkan 2 digit terakhir\")+IF(--MID(TEXT(N(SF$120),REPT(0,3)),2,2)>19,--MID(TEXT(N(SF$120),REPT(0,3)),3,1),--MID(TEXT(N(SF$120),REPT(0,3)),2,2))","v":0},{"$f":"N(\"Bila 2 digit terakhir > 19 MAKA hasilkan 1 digit terakhir BILA TIDAK hasilkan 2 digit terakhir\")+IF(--MID(TEXT(N(SG$120),REPT(0,3)),2,2)>19,--MID(TEXT(N(SG$120),REPT(0,3)),3,1),--MID(TEXT(N(SG$120),REPT(0,3)),2,2))","v":0}]
[null,"Tahap 1",{"$f":"IF(C121=0,\" \",VLOOKUP(C121,tblTerbilang,2,0)&\" ratus \")&IF(C122=0,\" \",VLOOKUP(C122,tblTerbilang,2,0)&\" puluh \")&IF(C123=0,\" \",VLOOKUP(C123,tblTerbilang,2,0))&IF(SUM(C121:C123)=0,\" \",\" milyar \")","v":"    "},{"$f":"IF(D121=0,\" \",VLOOKUP(D121,tblTerbilang,2,0)&\" ratus \")&IF(D122=0,\" \",VLOOKUP(D122,tblTerbilang,2,0)&\" puluh \")&IF(D123=0,\" \",VLOOKUP(D123,tblTerbilang,2,0))&IF(SUM(D121:D123)=0,\" \",\" juta \")","v":"  lima juta "},{"$f":"IF(E121=0,\" \",VLOOKUP(E121,tblTerbilang,2,0)&\" ratus \")&IF(E122=0,\" \",VLOOKUP(E122,tblTerbilang,2,0)&\" puluh \")&IF(E123=0,\" \",VLOOKUP(E123,tblTerbilang,2,0))&IF(SUM(E121:E123)=0,\" \",\" ribu \")","v":"    "},{"$f":"IF(F121=0,\" \",VLOOKUP(F121,tblTerbilang,2,0)&\" ratus \")&IF(F122=0,\" \",VLOOKUP(F122,tblTerbilang,2,0)&\" puluh \")&IF(F123=0,\" \",VLOOKUP(F123,tblTerbilang,2,0)&\" \")","v":"   "},null,null,null,null,null,null,null,null,null,null,null,null,null,null,null,null,null,null,null,null,null,null,null,null,null,null,null,null,null,null,null,null,null,null,null,null,null,null,null,null,null,null,null,null,null,null,null,null,null,null,"Tahap 1",{"$f":"IF(BF121=0,\" \",VLOOKUP(BF121,tblTerbilang,2,0)&\" ratus \")&IF(BF122=0,\" \",VLOOKUP(BF122,tblTerbilang,2,0)&\" puluh \")&IF(BF123=0,\" \",VLOOKUP(BF123,tblTerbilang,2,0))&IF(SUM(BF121:BF123)=0,\" \",\" milyar \")","v":"    "},{"$f":"IF(BG121=0,\" \",VLOOKUP(BG121,tblTerbilang,2,0)&\" ratus \")&IF(BG122=0,\" \",VLOOKUP(BG122,tblTerbilang,2,0)&\" puluh \")&IF(BG123=0,\" \",VLOOKUP(BG123,tblTerbilang,2,0))&IF(SUM(BG121:BG123)=0,\" \",\" juta \")","v":"  sepuluh juta "},{"$f":"IF(BH121=0,\" \",VLOOKUP(BH121,tblTerbilang,2,0)&\" ratus \")&IF(BH122=0,\" \",VLOOKUP(BH122,tblTerbilang,2,0)&\" puluh \")&IF(BH123=0,\" \",VLOOKUP(BH123,tblTerbilang,2,0))&IF(SUM(BH121:BH123)=0,\" \",\" ribu \")","v":"    "},{"$f":"IF(BI121=0,\" \",VLOOKUP(BI121,tblTerbilang,2,0)&\" ratus \")&IF(BI122=0,\" \",VLOOKUP(BI122,tblTerbilang,2,0)&\" puluh \")&IF(BI123=0,\" \",VLOOKUP(BI123,tblTerbilang,2,0)&\" \")","v":"   "},null,null,null,null,null,null,null,null,null,null,null,null,null,null,null,null,null,null,null,null,null,null,null,null,null,null,null,null,null,null,null,null,null,null,null,null,null,null,null,null,null,null,null,null,null,null,null,null,null,null,"Tahap 1",{"$f":"IF(DI121=0,\" \",VLOOKUP(DI121,tblTerbilang,2,0)&\" ratus \")&IF(DI122=0,\" \",VLOOKUP(DI122,tblTerbilang,2,0)&\" puluh \")&IF(DI123=0,\" \",VLOOKUP(DI123,tblTerbilang,2,0))&IF(SUM(DI121:DI123)=0,\" \",\" milyar \")","v":"    "},{"$f":"IF(DJ121=0,\" \",VLOOKUP(DJ121,tblTerbilang,2,0)&\" ratus \")&IF(DJ122=0,\" \",VLOOKUP(DJ122,tblTerbilang,2,0)&\" puluh \")&IF(DJ123=0,\" \",VLOOKUP(DJ123,tblTerbilang,2,0))&IF(SUM(DJ121:DJ123)=0,\" \",\" juta \")","v":"  tujuh juta "},{"$f":"IF(DK121=0,\" \",VLOOKUP(DK121,tblTerbilang,2,0)&\" ratus \")&IF(DK122=0,\" \",VLOOKUP(DK122,tblTerbilang,2,0)&\" puluh \")&IF(DK123=0,\" \",VLOOKUP(DK123,tblTerbilang,2,0))&IF(SUM(DK121:DK123)=0,\" \",\" ribu \")","v":"lima ratus    ribu "},{"$f":"IF(DL121=0,\" \",VLOOKUP(DL121,tblTerbilang,2,0)&\" ratus \")&IF(DL122=0,\" \",VLOOKUP(DL122,tblTerbilang,2,0)&\" puluh \")&IF(DL123=0,\" \",VLOOKUP(DL123,tblTerbilang,2,0)&\" \")","v":"   "},null,null,null,null,null,null,null,null,null,null,null,null,null,null,null,null,null,null,null,null,null,null,null,null,null,null,null,null,null,null,null,null,null,null,null,null,null,null,null,null,null,null,null,null,null,null,null,null,null,null,"Tahap 1",{"$f":"IF(FL121=0,\" \",VLOOKUP(FL121,tblTerbilang,2,0)&\" ratus \")&IF(FL122=0,\" \",VLOOKUP(FL122,tblTerbilang,2,0)&\" puluh \")&IF(FL123=0,\" \",VLOOKUP(FL123,tblTerbilang,2,0))&IF(SUM(FL121:FL123)=0,\" \",\" milyar \")","v":"    "},{"$f":"IF(FM121=0,\" \",VLOOKUP(FM121,tblTerbilang,2,0)&\" ratus \")&IF(FM122=0,\" \",VLOOKUP(FM122,tblTerbilang,2,0)&\" puluh \")&IF(FM123=0,\" \",VLOOKUP(FM123,tblTerbilang,2,0))&IF(SUM(FM121:FM123)=0,\" \",\" juta \")","v":"  enam juta "},{"$f":"IF(FN121=0,\" \",VLOOKUP(FN121,tblTerbilang,2,0)&\" ratus \")&IF(FN122=0,\" \",VLOOKUP(FN122,tblTerbilang,2,0)&\" puluh \")&IF(FN123=0,\" \",VLOOKUP(FN123,tblTerbilang,2,0))&IF(SUM(FN121:FN123)=0,\" \",\" ribu \")","v":"    "},{"$f":"IF(FO121=0,\" \",VLOOKUP(FO121,tblTerbilang,2,0)&\" ratus \")&IF(FO122=0,\" \",VLOOKUP(FO122,tblTerbilang,2,0)&\" puluh \")&IF(FO123=0,\" \",VLOOKUP(FO123,tblTerbilang,2,0)&\" \")","v":"   "},null,null,null,null,null,null,null,null,null,null,null,null,null,null,null,null,null,null,null,null,null,null,null,null,null,null,null,null,null,null,null,null,null,null,null,null,null,null,null,null,null,null,null,null,null,null,null,null,null,null,"Tahap 1",{"$f":"IF(HO121=0,\" \",VLOOKUP(HO121,tblTerbilang,2,0)&\" ratus \")&IF(HO122=0,\" \",VLOOKUP(HO122,tblTerbilang,2,0)&\" puluh \")&IF(HO123=0,\" \",VLOOKUP(HO123,tblTerbilang,2,0))&IF(SUM(HO121:HO123)=0,\" \",\" milyar \")","v":"    "},{"$f":"IF(HP121=0,\" \",VLOOKUP(HP121,tblTerbilang,2,0)&\" ratus \")&IF(HP122=0,\" \",VLOOKUP(HP122,tblTerbilang,2,0)&\" puluh \")&IF(HP123=0,\" \",VLOOKUP(HP123,tblTerbilang,2,0))&IF(SUM(HP121:HP123)=0,\" \",\" juta \")","v":"  enam juta "},{"$f":"IF(HQ121=0,\" \",VLOOKUP(HQ121,tblTerbilang,2,0)&\" ratus \")&IF(HQ122=0,\" \",VLOOKUP(HQ122,tblTerbilang,2,0)&\" puluh \")&IF(HQ123=0,\" \",VLOOKUP(HQ123,tblTerbilang,2,0))&IF(SUM(HQ121:HQ123)=0,\" \",\" ribu \")","v":"    "},{"$f":"IF(HR121=0,\" \",VLOOKUP(HR121,tblTerbilang,2,0)&\" ratus \")&IF(HR122=0,\" \",VLOOKUP(HR122,tblTerbilang,2,0)&\" puluh \")&IF(HR123=0,\" \",VLOOKUP(HR123,tblTerbilang,2,0)&\" \")","v":"   "},null,null,null,null,null,null,null,null,null,null,null,null,null,null,null,null,null,null,null,null,null,null,null,null,null,null,null,null,null,null,null,null,null,null,null,null,null,null,null,null,null,null,null,null,null,null,null,null,null,null,"Tahap 1",{"$f":"IF(JR121=0,\" \",VLOOKUP(JR121,tblTerbilang,2,0)&\" ratus \")&IF(JR122=0,\" \",VLOOKUP(JR122,tblTerbilang,2,0)&\" puluh \")&IF(JR123=0,\" \",VLOOKUP(JR123,tblTerbilang,2,0))&IF(SUM(JR121:JR123)=0,\" \",\" milyar \")","v":"    "},{"$f":"IF(JS121=0,\" \",VLOOKUP(JS121,tblTerbilang,2,0)&\" ratus \")&IF(JS122=0,\" \",VLOOKUP(JS122,tblTerbilang,2,0)&\" puluh \")&IF(JS123=0,\" \",VLOOKUP(JS123,tblTerbilang,2,0))&IF(SUM(JS121:JS123)=0,\" \",\" juta \")","v":"  delapan juta "},{"$f":"IF(JT121=0,\" \",VLOOKUP(JT121,tblTerbilang,2,0)&\" ratus \")&IF(JT122=0,\" \",VLOOKUP(JT122,tblTerbilang,2,0)&\" puluh \")&IF(JT123=0,\" \",VLOOKUP(JT123,tblTerbilang,2,0))&IF(SUM(JT121:JT123)=0,\" \",\" ribu \")","v":"    "},{"$f":"IF(JU121=0,\" \",VLOOKUP(JU121,tblTerbilang,2,0)&\" ratus \")&IF(JU122=0,\" \",VLOOKUP(JU122,tblTerbilang,2,0)&\" puluh \")&IF(JU123=0,\" \",VLOOKUP(JU123,tblTerbilang,2,0)&\" \")","v":"   "},null,null,null,null,null,null,null,null,null,null,null,null,null,null,null,null,null,null,null,null,null,null,null,null,null,null,null,null,null,null,null,null,null,null,null,null,null,null,null,null,null,null,null,null,null,null,null,null,null,null,"Tahap 1",{"$f":"IF(LU121=0,\" \",VLOOKUP(LU121,tblTerbilang,2,0)&\" ratus \")&IF(LU122=0,\" \",VLOOKUP(LU122,tblTerbilang,2,0)&\" puluh \")&IF(LU123=0,\" \",VLOOKUP(LU123,tblTerbilang,2,0))&IF(SUM(LU121:LU123)=0,\" \",\" milyar \")","v":"    "},{"$f":"IF(LV121=0,\" \",VLOOKUP(LV121,tblTerbilang,2,0)&\" ratus \")&IF(LV122=0,\" \",VLOOKUP(LV122,tblTerbilang,2,0)&\" puluh \")&IF(LV123=0,\" \",VLOOKUP(LV123,tblTerbilang,2,0))&IF(SUM(LV121:LV123)=0,\" \",\" juta \")","v":"  delapan juta "},{"$f":"IF(LW121=0,\" \",VLOOKUP(LW121,tblTerbilang,2,0)&\" ratus \")&IF(LW122=0,\" \",VLOOKUP(LW122,tblTerbilang,2,0)&\" puluh \")&IF(LW123=0,\" \",VLOOKUP(LW123,tblTerbilang,2,0))&IF(SUM(LW121:LW123)=0,\" \",\" ribu \")","v":"    "},{"$f":"IF(LX121=0,\" \",VLOOKUP(LX121,tblTerbilang,2,0)&\" ratus \")&IF(LX122=0,\" \",VLOOKUP(LX122,tblTerbilang,2,0)&\" puluh \")&IF(LX123=0,\" \",VLOOKUP(LX123,tblTerbilang,2,0)&\" \")","v":"   "},null,null,null,null,null,null,null,null,null,null,null,null,null,null,null,null,null,null,null,null,null,null,null,null,null,null,null,null,null,null,null,null,null,null,null,null,null,null,null,null,null,null,null,null,null,null,null,null,null,null,"Tahap 1",{"$f":"IF(NX121=0,\" \",VLOOKUP(NX121,tblTerbilang,2,0)&\" ratus \")&IF(NX122=0,\" \",VLOOKUP(NX122,tblTerbilang,2,0)&\" puluh \")&IF(NX123=0,\" \",VLOOKUP(NX123,tblTerbilang,2,0))&IF(SUM(NX121:NX123)=0,\" \",\" milyar \")","v":"    "},{"$f":"IF(NY121=0,\" \",VLOOKUP(NY121,tblTerbilang,2,0)&\" ratus \")&IF(NY122=0,\" \",VLOOKUP(NY122,tblTerbilang,2,0)&\" puluh \")&IF(NY123=0,\" \",VLOOKUP(NY123,tblTerbilang,2,0))&IF(SUM(NY121:NY123)=0,\" \",\" juta \")","v":"  tujuh juta "},{"$f":"IF(NZ121=0,\" \",VLOOKUP(NZ121,tblTerbilang,2,0)&\" ratus \")&IF(NZ122=0,\" \",VLOOKUP(NZ122,tblTerbilang,2,0)&\" puluh \")&IF(NZ123=0,\" \",VLOOKUP(NZ123,tblTerbilang,2,0))&IF(SUM(NZ121:NZ123)=0,\" \",\" ribu \")","v":"lima ratus    ribu "},{"$f":"IF(OA121=0,\" \",VLOOKUP(OA121,tblTerbilang,2,0)&\" ratus \")&IF(OA122=0,\" \",VLOOKUP(OA122,tblTerbilang,2,0)&\" puluh \")&IF(OA123=0,\" \",VLOOKUP(OA123,tblTerbilang,2,0)&\" \")","v":"   "},null,null,null,null,null,null,null,null,null,null,null,null,null,null,null,null,null,null,null,null,null,null,null,null,null,null,null,null,null,null,null,null,null,null,null,null,null,null,null,null,null,null,null,null,null,null,null,null,null,null,"Tahap 1",{"$f":"IF(QA121=0,\" \",VLOOKUP(QA121,tblTerbilang,2,0)&\" ratus \")&IF(QA122=0,\" \",VLOOKUP(QA122,tblTerbilang,2,0)&\" puluh \")&IF(QA123=0,\" \",VLOOKUP(QA123,tblTerbilang,2,0))&IF(SUM(QA121:QA123)=0,\" \",\" milyar \")","v":"    "},{"$f":"IF(QB121=0,\" \",VLOOKUP(QB121,tblTerbilang,2,0)&\" ratus \")&IF(QB122=0,\" \",VLOOKUP(QB122,tblTerbilang,2,0)&\" puluh \")&IF(QB123=0,\" \",VLOOKUP(QB123,tblTerbilang,2,0))&IF(SUM(QB121:QB123)=0,\" \",\" juta \")","v":"  tujuh juta "},{"$f":"IF(QC121=0,\" \",VLOOKUP(QC121,tblTerbilang,2,0)&\" ratus \")&IF(QC122=0,\" \",VLOOKUP(QC122,tblTerbilang,2,0)&\" puluh \")&IF(QC123=0,\" \",VLOOKUP(QC123,tblTerbilang,2,0))&IF(SUM(QC121:QC123)=0,\" \",\" ribu \")","v":"lima ratus    ribu "},{"$f":"IF(QD121=0,\" \",VLOOKUP(QD121,tblTerbilang,2,0)&\" ratus \")&IF(QD122=0,\" \",VLOOKUP(QD122,tblTerbilang,2,0)&\" puluh \")&IF(QD123=0,\" \",VLOOKUP(QD123,tblTerbilang,2,0)&\" \")","v":"   "},null,null,null,null,null,null,null,null,null,null,null,null,null,null,null,null,null,null,null,null,null,null,null,null,null,null,null,null,null,null,null,null,null,null,null,null,null,null,null,null,null,null,null,null,null,null,null,null,null,null,"Tahap 1",{"$f":"IF(SD121=0,\" \",VLOOKUP(SD121,tblTerbilang,2,0)&\" ratus \")&IF(SD122=0,\" \",VLOOKUP(SD122,tblTerbilang,2,0)&\" puluh \")&IF(SD123=0,\" \",VLOOKUP(SD123,tblTerbilang,2,0))&IF(SUM(SD121:SD123)=0,\" \",\" milyar \")","v":"    "},{"$f":"IF(SE121=0,\" \",VLOOKUP(SE121,tblTerbilang,2,0)&\" ratus \")&IF(SE122=0,\" \",VLOOKUP(SE122,tblTerbilang,2,0)&\" puluh \")&IF(SE123=0,\" \",VLOOKUP(SE123,tblTerbilang,2,0))&IF(SUM(SE121:SE123)=0,\" \",\" juta \")","v":"  tujuh juta "},{"$f":"IF(SF121=0,\" \",VLOOKUP(SF121,tblTerbilang,2,0)&\" ratus \")&IF(SF122=0,\" \",VLOOKUP(SF122,tblTerbilang,2,0)&\" puluh \")&IF(SF123=0,\" \",VLOOKUP(SF123,tblTerbilang,2,0))&IF(SUM(SF121:SF123)=0,\" \",\" ribu \")","v":"lima ratus    ribu "},{"$f":"IF(SG121=0,\" \",VLOOKUP(SG121,tblTerbilang,2,0)&\" ratus \")&IF(SG122=0,\" \",VLOOKUP(SG122,tblTerbilang,2,0)&\" puluh \")&IF(SG123=0,\" \",VLOOKUP(SG123,tblTerbilang,2,0)&\" \")","v":"   "}]
[null,"Tahap 2",{"$f":"TRIM(SUBSTITUTE(SUBSTITUTE(IF(C120=1,SUBSTITUTE(TRIM(C124),\"satu ribu\",\" seribu \"),TRIM(C124)),\"satu ratus\",\" seratus \"),\"satu puluh\",\" sepuluh \"))","v":""},{"$f":"TRIM(SUBSTITUTE(SUBSTITUTE(IF(D120=1,SUBSTITUTE(TRIM(D124),\"satu ribu\",\" seribu \"),TRIM(D124)),\"satu ratus\",\" seratus \"),\"satu puluh\",\" sepuluh \"))","v":"lima juta"},{"$f":"TRIM(SUBSTITUTE(SUBSTITUTE(IF(E120=1,SUBSTITUTE(TRIM(E124),\"satu ribu\",\" seribu \"),TRIM(E124)),\"satu ratus\",\" seratus \"),\"satu puluh\",\" sepuluh \"))","v":""},{"$f":"TRIM(SUBSTITUTE(SUBSTITUTE(IF(F120=1,SUBSTITUTE(TRIM(F124),\"satu ribu\",\" seribu \"),TRIM(F124)),\"satu ratus\",\" seratus \"),\"satu puluh\",\" sepuluh \"))","v":""},null,null,null,null,null,null,null,null,null,null,null,null,null,null,null,null,null,null,null,null,null,null,null,null,null,null,null,null,null,null,null,null,null,null,null,null,null,null,null,null,null,null,null,null,null,null,null,null,null,null,"Tahap 2",{"$f":"TRIM(SUBSTITUTE(SUBSTITUTE(IF(BF120=1,SUBSTITUTE(TRIM(BF124),\"satu ribu\",\" seribu \"),TRIM(BF124)),\"satu ratus\",\" seratus \"),\"satu puluh\",\" sepuluh \"))","v":""},{"$f":"TRIM(SUBSTITUTE(SUBSTITUTE(IF(BG120=1,SUBSTITUTE(TRIM(BG124),\"satu ribu\",\" seribu \"),TRIM(BG124)),\"satu ratus\",\" seratus \"),\"satu puluh\",\" sepuluh \"))","v":"sepuluh juta"},{"$f":"TRIM(SUBSTITUTE(SUBSTITUTE(IF(BH120=1,SUBSTITUTE(TRIM(BH124),\"satu ribu\",\" seribu \"),TRIM(BH124)),\"satu ratus\",\" seratus \"),\"satu puluh\",\" sepuluh \"))","v":""},{"$f":"TRIM(SUBSTITUTE(SUBSTITUTE(IF(BI120=1,SUBSTITUTE(TRIM(BI124),\"satu ribu\",\" seribu \"),TRIM(BI124)),\"satu ratus\",\" seratus \"),\"satu puluh\",\" sepuluh \"))","v":""},null,null,null,null,null,null,null,null,null,null,null,null,null,null,null,null,null,null,null,null,null,null,null,null,null,null,null,null,null,null,null,null,null,null,null,null,null,null,null,null,null,null,null,null,null,null,null,null,null,null,"Tahap 2",{"$f":"TRIM(SUBSTITUTE(SUBSTITUTE(IF(DI120=1,SUBSTITUTE(TRIM(DI124),\"satu ribu\",\" seribu \"),TRIM(DI124)),\"satu ratus\",\" seratus \"),\"satu puluh\",\" sepuluh \"))","v":""},{"$f":"TRIM(SUBSTITUTE(SUBSTITUTE(IF(DJ120=1,SUBSTITUTE(TRIM(DJ124),\"satu ribu\",\" seribu \"),TRIM(DJ124)),\"satu ratus\",\" seratus \"),\"satu puluh\",\" sepuluh \"))","v":"tujuh juta"},{"$f":"TRIM(SUBSTITUTE(SUBSTITUTE(IF(DK120=1,SUBSTITUTE(TRIM(DK124),\"satu ribu\",\" seribu \"),TRIM(DK124)),\"satu ratus\",\" seratus \"),\"satu puluh\",\" sepuluh \"))","v":"lima ratus ribu"},{"$f":"TRIM(SUBSTITUTE(SUBSTITUTE(IF(DL120=1,SUBSTITUTE(TRIM(DL124),\"satu ribu\",\" seribu \"),TRIM(DL124)),\"satu ratus\",\" seratus \"),\"satu puluh\",\" sepuluh \"))","v":""},null,null,null,null,null,null,null,null,null,null,null,null,null,null,null,null,null,null,null,null,null,null,null,null,null,null,null,null,null,null,null,null,null,null,null,null,null,null,null,null,null,null,null,null,null,null,null,null,null,null,"Tahap 2",{"$f":"TRIM(SUBSTITUTE(SUBSTITUTE(IF(FL120=1,SUBSTITUTE(TRIM(FL124),\"satu ribu\",\" seribu \"),TRIM(FL124)),\"satu ratus\",\" seratus \"),\"satu puluh\",\" sepuluh \"))","v":""},{"$f":"TRIM(SUBSTITUTE(SUBSTITUTE(IF(FM120=1,SUBSTITUTE(TRIM(FM124),\"satu ribu\",\" seribu \"),TRIM(FM124)),\"satu ratus\",\" seratus \"),\"satu puluh\",\" sepuluh \"))","v":"enam juta"},{"$f":"TRIM(SUBSTITUTE(SUBSTITUTE(IF(FN120=1,SUBSTITUTE(TRIM(FN124),\"satu ribu\",\" seribu \"),TRIM(FN124)),\"satu ratus\",\" seratus \"),\"satu puluh\",\" sepuluh \"))","v":""},{"$f":"TRIM(SUBSTITUTE(SUBSTITUTE(IF(FO120=1,SUBSTITUTE(TRIM(FO124),\"satu ribu\",\" seribu \"),TRIM(FO124)),\"satu ratus\",\" seratus \"),\"satu puluh\",\" sepuluh \"))","v":""},null,null,null,null,null,null,null,null,null,null,null,null,null,null,null,null,null,null,null,null,null,null,null,null,null,null,null,null,null,null,null,null,null,null,null,null,null,null,null,null,null,null,null,null,null,null,null,null,null,null,"Tahap 2",{"$f":"TRIM(SUBSTITUTE(SUBSTITUTE(IF(HO120=1,SUBSTITUTE(TRIM(HO124),\"satu ribu\",\" seribu \"),TRIM(HO124)),\"satu ratus\",\" seratus \"),\"satu puluh\",\" sepuluh \"))","v":""},{"$f":"TRIM(SUBSTITUTE(SUBSTITUTE(IF(HP120=1,SUBSTITUTE(TRIM(HP124),\"satu ribu\",\" seribu \"),TRIM(HP124)),\"satu ratus\",\" seratus \"),\"satu puluh\",\" sepuluh \"))","v":"enam juta"},{"$f":"TRIM(SUBSTITUTE(SUBSTITUTE(IF(HQ120=1,SUBSTITUTE(TRIM(HQ124),\"satu ribu\",\" seribu \"),TRIM(HQ124)),\"satu ratus\",\" seratus \"),\"satu puluh\",\" sepuluh \"))","v":""},{"$f":"TRIM(SUBSTITUTE(SUBSTITUTE(IF(HR120=1,SUBSTITUTE(TRIM(HR124),\"satu ribu\",\" seribu \"),TRIM(HR124)),\"satu ratus\",\" seratus \"),\"satu puluh\",\" sepuluh \"))","v":""},null,null,null,null,null,null,null,null,null,null,null,null,null,null,null,null,null,null,null,null,null,null,null,null,null,null,null,null,null,null,null,null,null,null,null,null,null,null,null,null,null,null,null,null,null,null,null,null,null,null,"Tahap 2",{"$f":"TRIM(SUBSTITUTE(SUBSTITUTE(IF(JR120=1,SUBSTITUTE(TRIM(JR124),\"satu ribu\",\" seribu \"),TRIM(JR124)),\"satu ratus\",\" seratus \"),\"satu puluh\",\" sepuluh \"))","v":""},{"$f":"TRIM(SUBSTITUTE(SUBSTITUTE(IF(JS120=1,SUBSTITUTE(TRIM(JS124),\"satu ribu\",\" seribu \"),TRIM(JS124)),\"satu ratus\",\" seratus \"),\"satu puluh\",\" sepuluh \"))","v":"delapan juta"},{"$f":"TRIM(SUBSTITUTE(SUBSTITUTE(IF(JT120=1,SUBSTITUTE(TRIM(JT124),\"satu ribu\",\" seribu \"),TRIM(JT124)),\"satu ratus\",\" seratus \"),\"satu puluh\",\" sepuluh \"))","v":""},{"$f":"TRIM(SUBSTITUTE(SUBSTITUTE(IF(JU120=1,SUBSTITUTE(TRIM(JU124),\"satu ribu\",\" seribu \"),TRIM(JU124)),\"satu ratus\",\" seratus \"),\"satu puluh\",\" sepuluh \"))","v":""},null,null,null,null,null,null,null,null,null,null,null,null,null,null,null,null,null,null,null,null,null,null,null,null,null,null,null,null,null,null,null,null,null,null,null,null,null,null,null,null,null,null,null,null,null,null,null,null,null,null,"Tahap 2",{"$f":"TRIM(SUBSTITUTE(SUBSTITUTE(IF(LU120=1,SUBSTITUTE(TRIM(LU124),\"satu ribu\",\" seribu \"),TRIM(LU124)),\"satu ratus\",\" seratus \"),\"satu puluh\",\" sepuluh \"))","v":""},{"$f":"TRIM(SUBSTITUTE(SUBSTITUTE(IF(LV120=1,SUBSTITUTE(TRIM(LV124),\"satu ribu\",\" seribu \"),TRIM(LV124)),\"satu ratus\",\" seratus \"),\"satu puluh\",\" sepuluh \"))","v":"delapan juta"},{"$f":"TRIM(SUBSTITUTE(SUBSTITUTE(IF(LW120=1,SUBSTITUTE(TRIM(LW124),\"satu ribu\",\" seribu \"),TRIM(LW124)),\"satu ratus\",\" seratus \"),\"satu puluh\",\" sepuluh \"))","v":""},{"$f":"TRIM(SUBSTITUTE(SUBSTITUTE(IF(LX120=1,SUBSTITUTE(TRIM(LX124),\"satu ribu\",\" seribu \"),TRIM(LX124)),\"satu ratus\",\" seratus \"),\"satu puluh\",\" sepuluh \"))","v":""},null,null,null,null,null,null,null,null,null,null,null,null,null,null,null,null,null,null,null,null,null,null,null,null,null,null,null,null,null,null,null,null,null,null,null,null,null,null,null,null,null,null,null,null,null,null,null,null,null,null,"Tahap 2",{"$f":"TRIM(SUBSTITUTE(SUBSTITUTE(IF(NX120=1,SUBSTITUTE(TRIM(NX124),\"satu ribu\",\" seribu \"),TRIM(NX124)),\"satu ratus\",\" seratus \"),\"satu puluh\",\" sepuluh \"))","v":""},{"$f":"TRIM(SUBSTITUTE(SUBSTITUTE(IF(NY120=1,SUBSTITUTE(TRIM(NY124),\"satu ribu\",\" seribu \"),TRIM(NY124)),\"satu ratus\",\" seratus \"),\"satu puluh\",\" sepuluh \"))","v":"tujuh juta"},{"$f":"TRIM(SUBSTITUTE(SUBSTITUTE(IF(NZ120=1,SUBSTITUTE(TRIM(NZ124),\"satu ribu\",\" seribu \"),TRIM(NZ124)),\"satu ratus\",\" seratus \"),\"satu puluh\",\" sepuluh \"))","v":"lima ratus ribu"},{"$f":"TRIM(SUBSTITUTE(SUBSTITUTE(IF(OA120=1,SUBSTITUTE(TRIM(OA124),\"satu ribu\",\" seribu \"),TRIM(OA124)),\"satu ratus\",\" seratus \"),\"satu puluh\",\" sepuluh \"))","v":""},null,null,null,null,null,null,null,null,null,null,null,null,null,null,null,null,null,null,null,null,null,null,null,null,null,null,null,null,null,null,null,null,null,null,null,null,null,null,null,null,null,null,null,null,null,null,null,null,null,null,"Tahap 2",{"$f":"TRIM(SUBSTITUTE(SUBSTITUTE(IF(QA120=1,SUBSTITUTE(TRIM(QA124),\"satu ribu\",\" seribu \"),TRIM(QA124)),\"satu ratus\",\" seratus \"),\"satu puluh\",\" sepuluh \"))","v":""},{"$f":"TRIM(SUBSTITUTE(SUBSTITUTE(IF(QB120=1,SUBSTITUTE(TRIM(QB124),\"satu ribu\",\" seribu \"),TRIM(QB124)),\"satu ratus\",\" seratus \"),\"satu puluh\",\" sepuluh \"))","v":"tujuh juta"},{"$f":"TRIM(SUBSTITUTE(SUBSTITUTE(IF(QC120=1,SUBSTITUTE(TRIM(QC124),\"satu ribu\",\" seribu \"),TRIM(QC124)),\"satu ratus\",\" seratus \"),\"satu puluh\",\" sepuluh \"))","v":"lima ratus ribu"},{"$f":"TRIM(SUBSTITUTE(SUBSTITUTE(IF(QD120=1,SUBSTITUTE(TRIM(QD124),\"satu ribu\",\" seribu \"),TRIM(QD124)),\"satu ratus\",\" seratus \"),\"satu puluh\",\" sepuluh \"))","v":""},null,null,null,null,null,null,null,null,null,null,null,null,null,null,null,null,null,null,null,null,null,null,null,null,null,null,null,null,null,null,null,null,null,null,null,null,null,null,null,null,null,null,null,null,null,null,null,null,null,null,"Tahap 2",{"$f":"TRIM(SUBSTITUTE(SUBSTITUTE(IF(SD120=1,SUBSTITUTE(TRIM(SD124),\"satu ribu\",\" seribu \"),TRIM(SD124)),\"satu ratus\",\" seratus \"),\"satu puluh\",\" sepuluh \"))","v":""},{"$f":"TRIM(SUBSTITUTE(SUBSTITUTE(IF(SE120=1,SUBSTITUTE(TRIM(SE124),\"satu ribu\",\" seribu \"),TRIM(SE124)),\"satu ratus\",\" seratus \"),\"satu puluh\",\" sepuluh \"))","v":"tujuh juta"},{"$f":"TRIM(SUBSTITUTE(SUBSTITUTE(IF(SF120=1,SUBSTITUTE(TRIM(SF124),\"satu ribu\",\" seribu \"),TRIM(SF124)),\"satu ratus\",\" seratus \"),\"satu puluh\",\" sepuluh \"))","v":"lima ratus ribu"},{"$f":"TRIM(SUBSTITUTE(SUBSTITUTE(IF(SG120=1,SUBSTITUTE(TRIM(SG124),\"satu ribu\",\" seribu \"),TRIM(SG124)),\"satu ratus\",\" seratus \"),\"satu puluh\",\" sepuluh \"))","v":""}]
[]
[]
[]
[]
[]
[]
[]
[]
[]
[]
[]
[]
[]
[]
[]
[]
[]
[]
[]
[]
[]
[]
[]
[]
[]
[]
[]
[]
[]
[]
[]
[]
[]
[]
[]
[]
[]
[]
[]
[]
[]
[]
[]
[]
[]
[]
[]
[]
[]
[]
[]
[]
[]
[]
[]
[]
[]
[]
[]
[]
[]
[]
[]
[]
[]
[]
[]
[]
[]
[]
[]
[]
[]
[]
[]
[]
[]
[]
[]
[]
[]
[]
[]
[]
[]
[]
[]
[]
[]
[]
[]
[]
[]
[]
[]
[]
[]
[]
[]
[]
[null,"Angka        ","Terbilang",null,null,null,null,null,null,null,null,null,null,null,null,null,null,null,null,null,null,null,null,null,null,null,null,null,null,null,null,null,null,null,null,null,null,null,null,null,null,null,null,null,null,null,null,null,null,null,null,null,null,null,null,null,{"$f":"IF(AND(HD!B2000=BE246,HD!B3000=BE247,HD!B4000=BE248),COUNTBLANK(Data!$A$1000000:$B$1000000),\"#\")","v":2},null,null,null,null,null,null,null,null,null,null,null,null,null,null,null,null,null,null,null,null,null,null,null,null,null,null,null,null,null,null,null,null,null,null,null,null,null,null,null,null,null,null,null,null,null,null,null,null,null,null,null,null,null,null,{"$f":"IF(AND(HD!B2000=BE246,HD!B4000=BE247),BE248,\"#\")","v":0}]
[null,0]
[null,1,"satu",null,null,null,null,null,null,null,null,null,null,null,null,null,null,null,null,null,null,null,null,null,null,null,null,null,null,null,null,null,null,null,null,null,null,null,null,null,null,null,null,null,null,null,null,null,null,null,null,null,null,null,null,null,{"$f":"IF(AND(HD!B2000=BE246,HD!B3000=BE247,HD!B4000=BE248),COUNTBLANK(Data!$A$1000000:$C$1000000),\"#\")","v":3},null,null,null,null,null,null,null,null,null,null,null,null,null,null,null,null,null,null,null,null,null,null,null,null,null,null,null,null,null,null,null,null,null,null,null,null,null,null,null,null,null,null,null,null,null,null,null,null,null,null,null,null,null,null,{"$f":"IF(AND(HD!B2000=BE246+BE247,HD!B4000=BE248),IF(Info!D5=0,\"ORGANISASI\",Info!D5),\"#\")","v":"PT. KEMBANG SEPATU"}]
[null,2,"dua"]
[null,3,"tiga",null,null,null,null,null,null,null,null,null,null,null,null,null,null,null,null,null,null,null,null,null,null,null,null,null,null,null,null,null,null,null,null,null,null,null,null,null,null,null,null,null,null,null,null,null,null,null,null,null,null,null,null,null,{"$f":"IF(AND(HD!B2000=BE246,HD!B3000=BE247,HD!B4000=BE248),COUNTBLANK(Data!$A$1000000:$E$1000000),\"#\")","v":5},null,null,null,null,null,null,null,null,null,null,null,null,null,null,null,null,null,null,null,null,null,null,null,null,null,null,null,null,null,null,null,null,null,null,null,null,null,null,null,null,null,null,null,null,null,null,null,null,null,null,null,null,null,null,{"$f":"IF(AND(HD!B2000=BE246+BE247,HD!B4000=BE248),IF(OR(Info!D6=0,Info!D7=0),\"ALAMAT\",Info!D6&\", \"&Info!D7),\"#\")","v":"Jl. Macan Kumbang No. 20, Perak, Surabaya"}]
[null,4,"empat"]
[null,5,"lima",null,null,null,null,null,null,null,null,null,null,null,null,null,null,null,null,null,null,null,null,null,null,null,null,null,null,null,null,null,null,null,null,null,null,null,null,null,null,null,null,null,null,null,null,null,null,null,null,null,null,null,null,null,{"$f":"IF(AND(HD!B2000=BE246,HD!B4000=BE247),COUNTBLANK(Data!$A$1000000:$F$1000000),\"#\")","v":6},null,null,null,null,null,null,null,null,null,null,null,null,null,null,null,null,null,null,null,null,null,null,null,null,null,null,null,null,null,null,null,null,null,null,null,null,null,null,null,null,null,null,null,null,null,null,null,null,null,null,null,null,null,null,{"$f":"IF(AND(HD!B2000=BE246,HD!B3000=BE247,HD!B4000=BE248),IF(Info!D7=0,\"....................\",Info!D7),\"#\")","v":"Surabaya"}]
[null,6,"enam"]
[null,7,"tujuh",null,null,null,null,null,null,null,null,null,null,null,null,null,null,null,null,null,null,null,null,null,null,null,null,null,null,null,null,null,null,null,null,null,null,null,null,null,null,null,null,null,null,null,null,null,null,null,null,null,null,null,null,null,{"$f":"IF(AND(HD!B2000=BE246,HD!B3000=BE247,HD!B4000=BE248),COUNTBLANK(Data!$A$1000000:$G$1000000),\"#\")","v":7},null,null,null,null,null,null,null,null,null,null,null,null,null,null,null,null,null,null,null,null,null,null,null,null,null,null,null,null,null,null,null,null,null,null,null,null,null,null,null,null,null,null,null,null,null,null,null,null,null,null,null,null,null,null,{"$f":"IF(AND(HD!B2000=BE246,HD!B3000=BE247,HD!B4000=BE248),IF(Info!D8=0,\"TELPON\",Info!D8),\"#\")","v":"(031) 700100"}]
[null,8,"delapan"]
[null,9,"sembilan",null,null,null,null,null,null,null,null,null,null,null,null,null,null,null,null,null,null,null,null,null,null,null,null,null,null,null,null,null,null,null,null,null,null,null,null,null,null,null,null,null,null,null,null,null,null,null,null,null,null,null,null,null,{"$f":"IF(AND(HD!B2000=BE246,HD!B3000=BE247,HD!B4000=BE248),COUNTBLANK(Data!$A$1000000:$H$1000000),\"#\")","v":8},null,null,null,null,null,null,null,null,null,null,null,null,null,null,null,null,null,null,null,null,null,null,null,null,null,null,null,null,null,null,null,null,null,null,null,null,null,null,null,null,null,null,null,null,null,null,null,null,null,null,null,null,null,null,{"$f":"IF(AND(HD!B2000=BE246,HD!B3000=BE247,HD!B4000=BE248),IF(Info!D9=0,\"EMAIL\",Info!D9),\"#\")","v":"pt_kembang.s@yahoo.com"}]
[null,10,"sepuluh"]
[null,11,"sebelas",null,null,null,null,null,null,null,null,null,null,null,null,null,null,null,null,null,null,null,null,null,null,null,null,null,null,null,null,null,null,null,null,null,null,null,null,null,null,null,null,null,null,null,null,null,null,null,null,null,null,null,null,null,{"$f":"IF(AND(HD!B2000=BE246,HD!B3000=BE247,HD!B4000=BE248),COUNTBLANK(Data!$A$1000000:$I$1000000),\"#\")","v":9},null,null,null,null,null,null,null,null,null,null,null,null,null,null,null,null,null,null,null,null,null,null,null,null,null,null,null,null,null,null,null,null,null,null,null,null,null,null,null,null,null,null,null,null,null,null,null,null,null,null,null,null,null,null,{"$f":"IF(AND(HD!B2000=BE246,HD!B3000=BE247,HD!B4000=BE248),IF(Info!D12=0,\"KETERANGAN-1\",Info!D12),\"#\")","v":"Pembayaran dianggap sah setelah masuk rekening kami :"}]
[null,null,null,null,null,null,null,null,null,null,null,null,null,null,null,null,null,null,null,null,null,null,null,null,null,null,null,null,null,null,null,null,null,null,null,null,null,null,null,null,null,null,null,null,null,null,null,null,null,null,null,null,null,null,null,null,null,null,null,null,null,null,null,null,null,null,null,null,null,null,null,null,null,null,null,null,null,null,null,null,null,null,null,null,null,null,null,null,null,null,null,null,null,null,null,null,null,null,null,null,null,null,null,null,null,null,null,null,null,null,null,{"$f":"IF(AND(HD!B2000=BE246,HD!B3000=BE247,HD!B4000=BE248),IF(Info!D13=0,\"KETERANGAN-2\",Info!D13),\"#\")","v":"- BCA 00.0000.0000 a/n PT. Kembang Sepatu"}]
[null,null,null,null,null,null,null,null,null,null,null,null,null,null,null,null,null,null,null,null,null,null,null,null,null,null,null,null,null,null,null,null,null,null,null,null,null,null,null,null,null,null,null,null,null,null,null,null,null,null,null,null,null,null,null,null,null,null,null,null,null,null,null,null,null,null,null,null,null,null,null,null,null,null,null,null,null,null,null,null,null,null,null,null,null,null,null,null,null,null,null,null,null,null,null,null,null,null,null,null,null,null,null,null,null,null,null,null,null,null,null,{"$f":"IF(AND(HD!B2000=BE246,HD!B3000=BE247,HD!B4000=BE248),IF(Info!D14=0,\"KETERANGAN-3\",Info!D14),\"#\")","v":"- MANDIRI 00.0000.000 a/n PT. Kembang Sepatu"}]
[null,12,"dua belas"]
[null,13,"tiga belas",null,null,null,null,null,null,null,null,null,null,null,null,null,null,null,null,null,null,null,null,null,null,null,null,null,null,null,null,null,null,null,null,null,null,null,null,null,null,null,null,null,null,null,null,null,null,null,null,null,null,null,null,null,"2019-01-01",null,null,null,null,null,null,null,null,null,null,null,null,null,null,null,null,null,null,null,null,null,null,null,null,null,null,null,null,null,null,null,null,null,null,null,null,null,null,null,null,null,null,null,null,null,null,null,null,null,null,null,null,null,null,{"$f":"Info!D16","v":"info@xclmedia.com"}]
[null,14,"empat belas",null,null,null,null,null,null,null,null,null,null,null,null,null,null,null,null,null,null,null,null,null,null,null,null,null,null,null,null,null,null,null,null,null,null,null,null,null,null,null,null,null,null,null,null,null,null,null,null,null,null,null,null,null,"2019-12-01"]
[null,15,"lima belas",null,null,null,null,null,null,null,null,null,null,null,null,null,null,null,null,null,null,null,null,null,null,null,null,null,null,null,null,null,null,null,null,null,null,null,null,null,null,null,null,null,null,null,null,null,null,null,null,null,null,null,null,null,{"$f":"DATE(Info!D10,MONTH(BE242),1)","v":"2019-01-01"}]
[null,16,"enam belas",null,null,null,null,null,null,null,null,null,null,null,null,null,null,null,null,null,null,null,null,null,null,null,null,null,null,null,null,null,null,null,null,null,null,null,null,null,null,null,null,null,null,null,null,null,null,null,null,null,null,null,null,null,{"$f":"DATE(Info!D10,MONTH(BE243),31)","v":"2019-12-31"}]
[null,17,"tujuh belas",null,null,null,null,null,null,null,null,null,null,null,null,null,null,null,null,null,null,null,null,null,null,null,null,null,null,null,null,null,null,null,null,null,null,null,null,null,null,null,null,null,null,null,null,null,null,null,null,null,null,null,null,null,{"$f":"IF(SMALL(Tgl,1)<43466,\"#\",0)","v":0}]
[null,18,"delapan belas",null,null,null,null,null,null,null,null,null,null,null,null,null,null,null,null,null,null,null,null,null,null,null,null,null,null,null,null,null,null,null,null,null,null,null,null,null,null,null,null,null,null,null,null,null,null,null,null,null,null,null,null,null,{"$f":"IF(LARGE(Tgl,1)>43830,\"#\",0)","v":0}]
[null,19,"sembilan belas",null,null,null,null,null,null,null,null,null,null,null,null,null,null,null,null,null,null,null,null,null,null,null,null,null,null,null,null,null,null,null,null,null,null,null,null,null,null,null,null,null,null,null,null,null,null,null,null,null,null,null,null,null,{"$f":"IF(OR(Info!D5=\"PT. KEMBANG SEPATU\",Info!D5=0),0,\"#\")","v":0}]

{"sheet":"Info","index":1,"n_rows":18,"n_cols":9,"rows_kept":18,"cut":false,"hidden":false,"merged":[[15,3,15,4],[8,3,8,4],[11,3,11,6],[12,3,12,6],[13,3,13,6],[11,2,13,2],[7,3,7,4],[6,3,6,4],[4,3,4,4],[5,3,5,6]]}
["  ","  ","  ","  ","  ","  ","  ","  ","  "]
["  ","  ","  ","  ","  ","  ","  ","  ","  "]
["  ","  ","  ","  ","  ","  ","  ","  ","  "]
["  ","  ","  ","  ","  ","  ","  ","  ","  "]
["  ","  ","ORGANISASI","PT. KEMBANG SEPATU",null,"  ","  ","  ","  "]
["  ","  ","ALAMAT","Jl. Macan Kumbang No. 20, Perak",null,null,null,"  ","  "]
["  ","  ","KOTA","Surabaya",null,"  ","  ","  ","  "]
["  ","  ","TELPON/FAX","(031) 700100",null,"  ","  ","  ","  "]
["  ","  ","EMAIL","pt_kembang.s@yahoo.com",null,"  ","  ","  ","  "]
["  ","  ","TAHUN",2019,"  ","  ","  ","  ","  "]
["  ","  ","  ","  ","  ","  ","  ","  ","  "]
["  ","  ","KETERANGAN","Pembayaran dianggap sah setelah masuk rekening kami :",null,null,null,"  ","  "]
["  ","  ",null,"- BCA 00.0000.0000 a/n PT. Kembang Sepatu",null,null,null,"  ","  "]
["  ","  ",null,"- MANDIRI 00.0000.000 a/n PT. Kembang Sepatu",null,null,null,"  ","  "]
["  ","  ","  ","  ","  ","  ","  ","  ","  "]
["  ","  ","REGISTRASI USER","info@xclmedia.com",null,"  ","  ","  ","  "]
["  ","  ","  ","  ","  ","  ","  ","  ","  "]
[{"$f":"IF(REG=D16,\"Reg: \"&REG&\" - @copyright: xclmedia.com\",\"Reg: Error - @copyright: xclmedia.com\")","v":"Reg: info@xclmedia.com - @copyright: xclmedia.com"},null,null,null,null,null,null,null,"  "]

{"sheet":"Data","index":2,"n_rows":1000,"n_cols":9,"rows_kept":1000,"cut":false,"hidden":false,"merged":[[2,0,2,7],[1,0,1,7],[0,0,0,7]]}
["DAFTAR KWITANSI PERIMAAAN PEMBAYARAN",null,null,null,null,null,null,null,"Copyright by xclmedia"]
[{"$f":"Nama","v":"PT. KEMBANG SEPATU"}]
[{"$f":"Alamat","v":"Jl. Macan Kumbang No. 20, Perak, Surabaya"}]
[]
["NO","TANGGAL","NAMA","ALAMAT","NO KWITANSI","JUMLAH BAYAR","KETERANGAN","PENANDA TANGAN","JABATAN"]
[{"$f":"IF(B6=0,\"-\",COUNTA($B$6:B6))","v":1},"2019-01-01","Customer 001","Alamat 001","KWT-0001",5000000,"Pembayaran piutang","Muhammad","Direktur"]
[{"$f":"IF(B7=0,\"-\",COUNTA($B$6:B7))","v":2},"2019-01-04","Customer 002","Alamat 002","KWT-0002",7500000,"Pembayaran piutang","Ahmadi","Manajer"]
[{"$f":"IF(B8=0,\"-\",COUNTA($B$6:B8))","v":3},"2019-01-06","Customer 003","Alamat 003","KWT-0003",5000000,"Pembayaran piutang","Ahmadi","Manajer"]
[{"$f":"IF(B9=0,\"-\",COUNTA($B$6:B9))","v":4},"2019-01-09","Customer 004","Alamat 004","KWT-0004",6000000,"Pembayaran piutang","Muhammad","Direktur"]
[{"$f":"IF(B10=0,\"-\",COUNTA($B$6:B10))","v":5},"2019-01-13","Customer 005","Alamat 005","KWT-0005",8000000,"Pembayaran piutang","Muhammad","Direktur"]
[{"$f":"IF(B11=0,\"-\",COUNTA($B$6:B11))","v":6},"2019-01-17","Customer 006","Alamat 006","KWT-0006",10000000,"Pembayaran piutang","Muhammad","Direktur"]
[{"$f":"IF(B12=0,\"-\",COUNTA($B$6:B12))","v":7},"2019-01-19","Customer 007","Alamat 007","KWT-0007",6500000,"Pembayaran piutang","Muhammad","Direktur"]
[{"$f":"IF(B13=0,\"-\",COUNTA($B$6:B13))","v":8},"2019-01-21","Customer 008","Alamat 008","KWT-0008",5000000,"Pembayaran piutang","Ahmadi","Manajer"]
[{"$f":"IF(B14=0,\"-\",COUNTA($B$6:B14))","v":9},"2019-01-25","Customer 009","Alamat 009","KWT-0009",9000000,"Pembayaran piutang","Ahmadi","Manajer"]
[{"$f":"IF(B15=0,\"-\",COUNTA($B$6:B15))","v":10},"2019-01-29","Customer 010","Alamat 010","KWT-0010",7000000,"Pembayaran piutang","Ahmadi","Manajer"]
[{"$f":"IF(B16=0,\"-\",COUNTA($B$6:B16))","v":"-"}]
[{"$f":"IF(B17=0,\"-\",COUNTA($B$6:B17))","v":"-"}]
[{"$f":"IF(B18=0,\"-\",COUNTA($B$6:B18))","v":"-"}]
[{"$f":"IF(B19=0,\"-\",COUNTA($B$6:B19))","v":"-"}]
[{"$f":"IF(B20=0,\"-\",COUNTA($B$6:B20))","v":"-"}]
[{"$f":"IF(B21=0,\"-\",COUNTA($B$6:B21))","v":"-"}]
[{"$f":"IF(B22=0,\"-\",COUNTA($B$6:B22))","v":"-"}]
[{"$f":"IF(B23=0,\"-\",COUNTA($B$6:B23))","v":"-"}]
[{"$f":"IF(B24=0,\"-\",COUNTA($B$6:B24))","v":"-"}]
[{"$f":"IF(B25=0,\"-\",COUNTA($B$6:B25))","v":"-"}]
[{"$f":"IF(B26=0,\"-\",COUNTA($B$6:B26))","v":"-"}]
[{"$f":"IF(B27=0,\"-\",COUNTA($B$6:B27))","v":"-"}]
[{"$f":"IF(B28=0,\"-\",COUNTA($B$6:B28))","v":"-"}]
[{"$f":"IF(B29=0,\"-\",COUNTA($B$6:B29))","v":"-"}]
[{"$f":"IF(B30=0,\"-\",COUNTA($B$6:B30))","v":"-"}]
[{"$f":"IF(B31=0,\"-\",COUNTA($B$6:B31))","v":"-"}]
[{"$f":"IF(B32=0,\"-\",COUNTA($B$6:B32))","v":"-"}]
[{"$f":"IF(B33=0,\"-\",COUNTA($B$6:B33))","v":"-"}]
[{"$f":"IF(B34=0,\"-\",COUNTA($B$6:B34))","v":"-"}]
[{"$f":"IF(B35=0,\"-\",COUNTA($B$6:B35))","v":"-"}]
[{"$f":"IF(B36=0,\"-\",COUNTA($B$6:B36))","v":"-"}]
[{"$f":"IF(B37=0,\"-\",COUNTA($B$6:B37))","v":"-"}]
[{"$f":"IF(B38=0,\"-\",COUNTA($B$6:B38))","v":"-"}]
[{"$f":"IF(B39=0,\"-\",COUNTA($B$6:B39))","v":"-"}]
[{"$f":"IF(B40=0,\"-\",COUNTA($B$6:B40))","v":"-"}]
[{"$f":"IF(B41=0,\"-\",COUNTA($B$6:B41))","v":"-"}]
[{"$f":"IF(B42=0,\"-\",COUNTA($B$6:B42))","v":"-"}]
[{"$f":"IF(B43=0,\"-\",COUNTA($B$6:B43))","v":"-"}]
[{"$f":"IF(B44=0,\"-\",COUNTA($B$6:B44))","v":"-"}]
[{"$f":"IF(B45=0,\"-\",COUNTA($B$6:B45))","v":"-"}]
[{"$f":"IF(B46=0,\"-\",COUNTA($B$6:B46))","v":"-"}]
[{"$f":"IF(B47=0,\"-\",COUNTA($B$6:B47))","v":"-"}]
[{"$f":"IF(B48=0,\"-\",COUNTA($B$6:B48))","v":"-"}]
[{"$f":"IF(B49=0,\"-\",COUNTA($B$6:B49))","v":"-"}]
[{"$f":"IF(B50=0,\"-\",COUNTA($B$6:B50))","v":"-"}]
[{"$f":"IF(B51=0,\"-\",COUNTA($B$6:B51))","v":"-"}]
[{"$f":"IF(B52=0,\"-\",COUNTA($B$6:B52))","v":"-"}]
[{"$f":"IF(B53=0,\"-\",COUNTA($B$6:B53))","v":"-"}]
[{"$f":"IF(B54=0,\"-\",COUNTA($B$6:B54))","v":"-"}]
[{"$f":"IF(B55=0,\"-\",COUNTA($B$6:B55))","v":"-"}]
[{"$f":"IF(B56=0,\"-\",COUNTA($B$6:B56))","v":"-"}]
[{"$f":"IF(B57=0,\"-\",COUNTA($B$6:B57))","v":"-"}]
[{"$f":"IF(B58=0,\"-\",COUNTA($B$6:B58))","v":"-"}]
[{"$f":"IF(B59=0,\"-\",COUNTA($B$6:B59))","v":"-"}]
[{"$f":"IF(B60=0,\"-\",COUNTA($B$6:B60))","v":"-"}]
[{"$f":"IF(B61=0,\"-\",COUNTA($B$6:B61))","v":"-"}]
[{"$f":"IF(B62=0,\"-\",COUNTA($B$6:B62))","v":"-"}]
[{"$f":"IF(B63=0,\"-\",COUNTA($B$6:B63))","v":"-"}]
[{"$f":"IF(B64=0,\"-\",COUNTA($B$6:B64))","v":"-"}]
[{"$f":"IF(B65=0,\"-\",COUNTA($B$6:B65))","v":"-"}]
[{"$f":"IF(B66=0,\"-\",COUNTA($B$6:B66))","v":"-"}]
[{"$f":"IF(B67=0,\"-\",COUNTA($B$6:B67))","v":"-"}]
[{"$f":"IF(B68=0,\"-\",COUNTA($B$6:B68))","v":"-"}]
[{"$f":"IF(B69=0,\"-\",COUNTA($B$6:B69))","v":"-"}]
[{"$f":"IF(B70=0,\"-\",COUNTA($B$6:B70))","v":"-"}]
[{"$f":"IF(B71=0,\"-\",COUNTA($B$6:B71))","v":"-"}]
[{"$f":"IF(B72=0,\"-\",COUNTA($B$6:B72))","v":"-"}]
[{"$f":"IF(B73=0,\"-\",COUNTA($B$6:B73))","v":"-"}]
[{"$f":"IF(B74=0,\"-\",COUNTA($B$6:B74))","v":"-"}]
[{"$f":"IF(B75=0,\"-\",COUNTA($B$6:B75))","v":"-"}]
[{"$f":"IF(B76=0,\"-\",COUNTA($B$6:B76))","v":"-"}]
[{"$f":"IF(B77=0,\"-\",COUNTA($B$6:B77))","v":"-"}]
[{"$f":"IF(B78=0,\"-\",COUNTA($B$6:B78))","v":"-"}]
[{"$f":"IF(B79=0,\"-\",COUNTA($B$6:B79))","v":"-"}]
[{"$f":"IF(B80=0,\"-\",COUNTA($B$6:B80))","v":"-"}]
[{"$f":"IF(B81=0,\"-\",COUNTA($B$6:B81))","v":"-"}]
[{"$f":"IF(B82=0,\"-\",COUNTA($B$6:B82))","v":"-"}]
[{"$f":"IF(B83=0,\"-\",COUNTA($B$6:B83))","v":"-"}]
[{"$f":"IF(B84=0,\"-\",COUNTA($B$6:B84))","v":"-"}]
[{"$f":"IF(B85=0,\"-\",COUNTA($B$6:B85))","v":"-"}]
[{"$f":"IF(B86=0,\"-\",COUNTA($B$6:B86))","v":"-"}]
[{"$f":"IF(B87=0,\"-\",COUNTA($B$6:B87))","v":"-"}]
[{"$f":"IF(B88=0,\"-\",COUNTA($B$6:B88))","v":"-"}]
[{"$f":"IF(B89=0,\"-\",COUNTA($B$6:B89))","v":"-"}]
[{"$f":"IF(B90=0,\"-\",COUNTA($B$6:B90))","v":"-"}]
[{"$f":"IF(B91=0,\"-\",COUNTA($B$6:B91))","v":"-"}]
[{"$f":"IF(B92=0,\"-\",COUNTA($B$6:B92))","v":"-"}]
[{"$f":"IF(B93=0,\"-\",COUNTA($B$6:B93))","v":"-"}]
[{"$f":"IF(B94=0,\"-\",COUNTA($B$6:B94))","v":"-"}]
[{"$f":"IF(B95=0,\"-\",COUNTA($B$6:B95))","v":"-"}]
[{"$f":"IF(B96=0,\"-\",COUNTA($B$6:B96))","v":"-"}]
[{"$f":"IF(B97=0,\"-\",COUNTA($B$6:B97))","v":"-"}]
[{"$f":"IF(B98=0,\"-\",COUNTA($B$6:B98))","v":"-"}]
[{"$f":"IF(B99=0,\"-\",COUNTA($B$6:B99))","v":"-"}]
[{"$f":"IF(B100=0,\"-\",COUNTA($B$6:B100))","v":"-"}]
[{"$f":"IF(B101=0,\"-\",COUNTA($B$6:B101))","v":"-"}]
[{"$f":"IF(B102=0,\"-\",COUNTA($B$6:B102))","v":"-"}]
[{"$f":"IF(B103=0,\"-\",COUNTA($B$6:B103))","v":"-"}]
[{"$f":"IF(B104=0,\"-\",COUNTA($B$6:B104))","v":"-"}]
[{"$f":"IF(B105=0,\"-\",COUNTA($B$6:B105))","v":"-"}]
[{"$f":"IF(B106=0,\"-\",COUNTA($B$6:B106))","v":"-"}]
[{"$f":"IF(B107=0,\"-\",COUNTA($B$6:B107))","v":"-"}]
[{"$f":"IF(B108=0,\"-\",COUNTA($B$6:B108))","v":"-"}]
[{"$f":"IF(B109=0,\"-\",COUNTA($B$6:B109))","v":"-"}]
[{"$f":"IF(B110=0,\"-\",COUNTA($B$6:B110))","v":"-"}]
[{"$f":"IF(B111=0,\"-\",COUNTA($B$6:B111))","v":"-"}]
[{"$f":"IF(B112=0,\"-\",COUNTA($B$6:B112))","v":"-"}]
[{"$f":"IF(B113=0,\"-\",COUNTA($B$6:B113))","v":"-"}]
[{"$f":"IF(B114=0,\"-\",COUNTA($B$6:B114))","v":"-"}]
[{"$f":"IF(B115=0,\"-\",COUNTA($B$6:B115))","v":"-"}]
[{"$f":"IF(B116=0,\"-\",COUNTA($B$6:B116))","v":"-"}]
[{"$f":"IF(B117=0,\"-\",COUNTA($B$6:B117))","v":"-"}]
[{"$f":"IF(B118=0,\"-\",COUNTA($B$6:B118))","v":"-"}]
[{"$f":"IF(B119=0,\"-\",COUNTA($B$6:B119))","v":"-"}]
[{"$f":"IF(B120=0,\"-\",COUNTA($B$6:B120))","v":"-"}]
[{"$f":"IF(B121=0,\"-\",COUNTA($B$6:B121))","v":"-"}]
[{"$f":"IF(B122=0,\"-\",COUNTA($B$6:B122))","v":"-"}]
[{"$f":"IF(B123=0,\"-\",COUNTA($B$6:B123))","v":"-"}]
[{"$f":"IF(B124=0,\"-\",COUNTA($B$6:B124))","v":"-"}]
[{"$f":"IF(B125=0,\"-\",COUNTA($B$6:B125))","v":"-"}]
[{"$f":"IF(B126=0,\"-\",COUNTA($B$6:B126))","v":"-"}]
[{"$f":"IF(B127=0,\"-\",COUNTA($B$6:B127))","v":"-"}]
[{"$f":"IF(B128=0,\"-\",COUNTA($B$6:B128))","v":"-"}]
[{"$f":"IF(B129=0,\"-\",COUNTA($B$6:B129))","v":"-"}]
[{"$f":"IF(B130=0,\"-\",COUNTA($B$6:B130))","v":"-"}]
[{"$f":"IF(B131=0,\"-\",COUNTA($B$6:B131))","v":"-"}]
[{"$f":"IF(B132=0,\"-\",COUNTA($B$6:B132))","v":"-"}]
[{"$f":"IF(B133=0,\"-\",COUNTA($B$6:B133))","v":"-"}]
[{"$f":"IF(B134=0,\"-\",COUNTA($B$6:B134))","v":"-"}]
[{"$f":"IF(B135=0,\"-\",COUNTA($B$6:B135))","v":"-"}]
[{"$f":"IF(B136=0,\"-\",COUNTA($B$6:B136))","v":"-"}]
[{"$f":"IF(B137=0,\"-\",COUNTA($B$6:B137))","v":"-"}]
[{"$f":"IF(B138=0,\"-\",COUNTA($B$6:B138))","v":"-"}]
[{"$f":"IF(B139=0,\"-\",COUNTA($B$6:B139))","v":"-"}]
[{"$f":"IF(B140=0,\"-\",COUNTA($B$6:B140))","v":"-"}]
[{"$f":"IF(B141=0,\"-\",COUNTA($B$6:B141))","v":"-"}]
[{"$f":"IF(B142=0,\"-\",COUNTA($B$6:B142))","v":"-"}]
[{"$f":"IF(B143=0,\"-\",COUNTA($B$6:B143))","v":"-"}]
[{"$f":"IF(B144=0,\"-\",COUNTA($B$6:B144))","v":"-"}]
[{"$f":"IF(B145=0,\"-\",COUNTA($B$6:B145))","v":"-"}]
[{"$f":"IF(B146=0,\"-\",COUNTA($B$6:B146))","v":"-"}]
[{"$f":"IF(B147=0,\"-\",COUNTA($B$6:B147))","v":"-"}]
[{"$f":"IF(B148=0,\"-\",COUNTA($B$6:B148))","v":"-"}]
[{"$f":"IF(B149=0,\"-\",COUNTA($B$6:B149))","v":"-"}]
[{"$f":"IF(B150=0,\"-\",COUNTA($B$6:B150))","v":"-"}]
[{"$f":"IF(B151=0,\"-\",COUNTA($B$6:B151))","v":"-"}]
[{"$f":"IF(B152=0,\"-\",COUNTA($B$6:B152))","v":"-"}]
[{"$f":"IF(B153=0,\"-\",COUNTA($B$6:B153))","v":"-"}]
[{"$f":"IF(B154=0,\"-\",COUNTA($B$6:B154))","v":"-"}]
[{"$f":"IF(B155=0,\"-\",COUNTA($B$6:B155))","v":"-"}]
[{"$f":"IF(B156=0,\"-\",COUNTA($B$6:B156))","v":"-"}]
[{"$f":"IF(B157=0,\"-\",COUNTA($B$6:B157))","v":"-"}]
[{"$f":"IF(B158=0,\"-\",COUNTA($B$6:B158))","v":"-"}]
[{"$f":"IF(B159=0,\"-\",COUNTA($B$6:B159))","v":"-"}]
[{"$f":"IF(B160=0,\"-\",COUNTA($B$6:B160))","v":"-"}]
[{"$f":"IF(B161=0,\"-\",COUNTA($B$6:B161))","v":"-"}]
[{"$f":"IF(B162=0,\"-\",COUNTA($B$6:B162))","v":"-"}]
[{"$f":"IF(B163=0,\"-\",COUNTA($B$6:B163))","v":"-"}]
[{"$f":"IF(B164=0,\"-\",COUNTA($B$6:B164))","v":"-"}]
[{"$f":"IF(B165=0,\"-\",COUNTA($B$6:B165))","v":"-"}]
[{"$f":"IF(B166=0,\"-\",COUNTA($B$6:B166))","v":"-"}]
[{"$f":"IF(B167=0,\"-\",COUNTA($B$6:B167))","v":"-"}]
[{"$f":"IF(B168=0,\"-\",COUNTA($B$6:B168))","v":"-"}]
[{"$f":"IF(B169=0,\"-\",COUNTA($B$6:B169))","v":"-"}]
[{"$f":"IF(B170=0,\"-\",COUNTA($B$6:B170))","v":"-"}]
[{"$f":"IF(B171=0,\"-\",COUNTA($B$6:B171))","v":"-"}]
[{"$f":"IF(B172=0,\"-\",COUNTA($B$6:B172))","v":"-"}]
[{"$f":"IF(B173=0,\"-\",COUNTA($B$6:B173))","v":"-"}]
[{"$f":"IF(B174=0,\"-\",COUNTA($B$6:B174))","v":"-"}]
[{"$f":"IF(B175=0,\"-\",COUNTA($B$6:B175))","v":"-"}]
[{"$f":"IF(B176=0,\"-\",COUNTA($B$6:B176))","v":"-"}]
[{"$f":"IF(B177=0,\"-\",COUNTA($B$6:B177))","v":"-"}]
[{"$f":"IF(B178=0,\"-\",COUNTA($B$6:B178))","v":"-"}]
[{"$f":"IF(B179=0,\"-\",COUNTA($B$6:B179))","v":"-"}]
[{"$f":"IF(B180=0,\"-\",COUNTA($B$6:B180))","v":"-"}]
[{"$f":"IF(B181=0,\"-\",COUNTA($B$6:B181))","v":"-"}]
[{"$f":"IF(B182=0,\"-\",COUNTA($B$6:B182))","v":"-"}]
[{"$f":"IF(B183=0,\"-\",COUNTA($B$6:B183))","v":"-"}]
[{"$f":"IF(B184=0,\"-\",COUNTA($B$6:B184))","v":"-"}]
[{"$f":"IF(B185=0,\"-\",COUNTA($B$6:B185))","v":"-"}]
[{"$f":"IF(B186=0,\"-\",COUNTA($B$6:B186))","v":"-"}]
[{"$f":"IF(B187=0,\"-\",COUNTA($B$6:B187))","v":"-"}]
[{"$f":"IF(B188=0,\"-\",COUNTA($B$6:B188))","v":"-"}]
[{"$f":"IF(B189=0,\"-\",COUNTA($B$6:B189))","v":"-"}]
[{"$f":"IF(B190=0,\"-\",COUNTA($B$6:B190))","v":"-"}]
[{"$f":"IF(B191=0,\"-\",COUNTA($B$6:B191))","v":"-"}]
[{"$f":"IF(B192=0,\"-\",COUNTA($B$6:B192))","v":"-"}]
[{"$f":"IF(B193=0,\"-\",COUNTA($B$6:B193))","v":"-"}]
[{"$f":"IF(B194=0,\"-\",COUNTA($B$6:B194))","v":"-"}]
[{"$f":"IF(B195=0,\"-\",COUNTA($B$6:B195))","v":"-"}]
[{"$f":"IF(B196=0,\"-\",COUNTA($B$6:B196))","v":"-"}]
[{"$f":"IF(B197=0,\"-\",COUNTA($B$6:B197))","v":"-"}]
[{"$f":"IF(B198=0,\"-\",COUNTA($B$6:B198))","v":"-"}]
[{"$f":"IF(B199=0,\"-\",COUNTA($B$6:B199))","v":"-"}]
[{"$f":"IF(B200=0,\"-\",COUNTA($B$6:B200))","v":"-"}]
[{"$f":"IF(B201=0,\"-\",COUNTA($B$6:B201))","v":"-"}]
[{"$f":"IF(B202=0,\"-\",COUNTA($B$6:B202))","v":"-"}]
[{"$f":"IF(B203=0,\"-\",COUNTA($B$6:B203))","v":"-"}]
[{"$f":"IF(B204=0,\"-\",COUNTA($B$6:B204))","v":"-"}]
[{"$f":"IF(B205=0,\"-\",COUNTA($B$6:B205))","v":"-"}]
[{"$f":"IF(B206=0,\"-\",COUNTA($B$6:B206))","v":"-"}]
[{"$f":"IF(B207=0,\"-\",COUNTA($B$6:B207))","v":"-"}]
[{"$f":"IF(B208=0,\"-\",COUNTA($B$6:B208))","v":"-"}]
[{"$f":"IF(B209=0,\"-\",COUNTA($B$6:B209))","v":"-"}]
[{"$f":"IF(B210=0,\"-\",COUNTA($B$6:B210))","v":"-"}]
[{"$f":"IF(B211=0,\"-\",COUNTA($B$6:B211))","v":"-"}]
[{"$f":"IF(B212=0,\"-\",COUNTA($B$6:B212))","v":"-"}]
[{"$f":"IF(B213=0,\"-\",COUNTA($B$6:B213))","v":"-"}]
[{"$f":"IF(B214=0,\"-\",COUNTA($B$6:B214))","v":"-"}]
[{"$f":"IF(B215=0,\"-\",COUNTA($B$6:B215))","v":"-"}]
[{"$f":"IF(B216=0,\"-\",COUNTA($B$6:B216))","v":"-"}]
[{"$f":"IF(B217=0,\"-\",COUNTA($B$6:B217))","v":"-"}]
[{"$f":"IF(B218=0,\"-\",COUNTA($B$6:B218))","v":"-"}]
[{"$f":"IF(B219=0,\"-\",COUNTA($B$6:B219))","v":"-"}]
[{"$f":"IF(B220=0,\"-\",COUNTA($B$6:B220))","v":"-"}]
[{"$f":"IF(B221=0,\"-\",COUNTA($B$6:B221))","v":"-"}]
[{"$f":"IF(B222=0,\"-\",COUNTA($B$6:B222))","v":"-"}]
[{"$f":"IF(B223=0,\"-\",COUNTA($B$6:B223))","v":"-"}]
[{"$f":"IF(B224=0,\"-\",COUNTA($B$6:B224))","v":"-"}]
[{"$f":"IF(B225=0,\"-\",COUNTA($B$6:B225))","v":"-"}]
[{"$f":"IF(B226=0,\"-\",COUNTA($B$6:B226))","v":"-"}]
[{"$f":"IF(B227=0,\"-\",COUNTA($B$6:B227))","v":"-"}]
[{"$f":"IF(B228=0,\"-\",COUNTA($B$6:B228))","v":"-"}]
[{"$f":"IF(B229=0,\"-\",COUNTA($B$6:B229))","v":"-"}]
[{"$f":"IF(B230=0,\"-\",COUNTA($B$6:B230))","v":"-"}]
[{"$f":"IF(B231=0,\"-\",COUNTA($B$6:B231))","v":"-"}]
[{"$f":"IF(B232=0,\"-\",COUNTA($B$6:B232))","v":"-"}]
[{"$f":"IF(B233=0,\"-\",COUNTA($B$6:B233))","v":"-"}]
[{"$f":"IF(B234=0,\"-\",COUNTA($B$6:B234))","v":"-"}]
[{"$f":"IF(B235=0,\"-\",COUNTA($B$6:B235))","v":"-"}]
[{"$f":"IF(B236=0,\"-\",COUNTA($B$6:B236))","v":"-"}]
[{"$f":"IF(B237=0,\"-\",COUNTA($B$6:B237))","v":"-"}]
[{"$f":"IF(B238=0,\"-\",COUNTA($B$6:B238))","v":"-"}]
[{"$f":"IF(B239=0,\"-\",COUNTA($B$6:B239))","v":"-"}]
[{"$f":"IF(B240=0,\"-\",COUNTA($B$6:B240))","v":"-"}]
[{"$f":"IF(B241=0,\"-\",COUNTA($B$6:B241))","v":"-"}]
[{"$f":"IF(B242=0,\"-\",COUNTA($B$6:B242))","v":"-"}]
[{"$f":"IF(B243=0,\"-\",COUNTA($B$6:B243))","v":"-"}]
[{"$f":"IF(B244=0,\"-\",COUNTA($B$6:B244))","v":"-"}]
[{"$f":"IF(B245=0,\"-\",COUNTA($B$6:B245))","v":"-"}]
[{"$f":"IF(B246=0,\"-\",COUNTA($B$6:B246))","v":"-"}]
[{"$f":"IF(B247=0,\"-\",COUNTA($B$6:B247))","v":"-"}]
[{"$f":"IF(B248=0,\"-\",COUNTA($B$6:B248))","v":"-"}]
[{"$f":"IF(B249=0,\"-\",COUNTA($B$6:B249))","v":"-"}]
[{"$f":"IF(B250=0,\"-\",COUNTA($B$6:B250))","v":"-"}]
[{"$f":"IF(B251=0,\"-\",COUNTA($B$6:B251))","v":"-"}]
[{"$f":"IF(B252=0,\"-\",COUNTA($B$6:B252))","v":"-"}]
[{"$f":"IF(B253=0,\"-\",COUNTA($B$6:B253))","v":"-"}]
[{"$f":"IF(B254=0,\"-\",COUNTA($B$6:B254))","v":"-"}]
[{"$f":"IF(B255=0,\"-\",COUNTA($B$6:B255))","v":"-"}]
[{"$f":"IF(B256=0,\"-\",COUNTA($B$6:B256))","v":"-"}]
[{"$f":"IF(B257=0,\"-\",COUNTA($B$6:B257))","v":"-"}]
[{"$f":"IF(B258=0,\"-\",COUNTA($B$6:B258))","v":"-"}]
[{"$f":"IF(B259=0,\"-\",COUNTA($B$6:B259))","v":"-"}]
[{"$f":"IF(B260=0,\"-\",COUNTA($B$6:B260))","v":"-"}]
[{"$f":"IF(B261=0,\"-\",COUNTA($B$6:B261))","v":"-"}]
[{"$f":"IF(B262=0,\"-\",COUNTA($B$6:B262))","v":"-"}]
[{"$f":"IF(B263=0,\"-\",COUNTA($B$6:B263))","v":"-"}]
[{"$f":"IF(B264=0,\"-\",COUNTA($B$6:B264))","v":"-"}]
[{"$f":"IF(B265=0,\"-\",COUNTA($B$6:B265))","v":"-"}]
[{"$f":"IF(B266=0,\"-\",COUNTA($B$6:B266))","v":"-"}]
[{"$f":"IF(B267=0,\"-\",COUNTA($B$6:B267))","v":"-"}]
[{"$f":"IF(B268=0,\"-\",COUNTA($B$6:B268))","v":"-"}]
[{"$f":"IF(B269=0,\"-\",COUNTA($B$6:B269))","v":"-"}]
[{"$f":"IF(B270=0,\"-\",COUNTA($B$6:B270))","v":"-"}]
[{"$f":"IF(B271=0,\"-\",COUNTA($B$6:B271))","v":"-"}]
[{"$f":"IF(B272=0,\"-\",COUNTA($B$6:B272))","v":"-"}]
[{"$f":"IF(B273=0,\"-\",COUNTA($B$6:B273))","v":"-"}]
[{"$f":"IF(B274=0,\"-\",COUNTA($B$6:B274))","v":"-"}]
[{"$f":"IF(B275=0,\"-\",COUNTA($B$6:B275))","v":"-"}]
[{"$f":"IF(B276=0,\"-\",COUNTA($B$6:B276))","v":"-"}]
[{"$f":"IF(B277=0,\"-\",COUNTA($B$6:B277))","v":"-"}]
[{"$f":"IF(B278=0,\"-\",COUNTA($B$6:B278))","v":"-"}]
[{"$f":"IF(B279=0,\"-\",COUNTA($B$6:B279))","v":"-"}]
[{"$f":"IF(B280=0,\"-\",COUNTA($B$6:B280))","v":"-"}]
[{"$f":"IF(B281=0,\"-\",COUNTA($B$6:B281))","v":"-"}]
[{"$f":"IF(B282=0,\"-\",COUNTA($B$6:B282))","v":"-"}]
[{"$f":"IF(B283=0,\"-\",COUNTA($B$6:B283))","v":"-"}]
[{"$f":"IF(B284=0,\"-\",COUNTA($B$6:B284))","v":"-"}]
[{"$f":"IF(B285=0,\"-\",COUNTA($B$6:B285))","v":"-"}]
[{"$f":"IF(B286=0,\"-\",COUNTA($B$6:B286))","v":"-"}]
[{"$f":"IF(B287=0,\"-\",COUNTA($B$6:B287))","v":"-"}]
[{"$f":"IF(B288=0,\"-\",COUNTA($B$6:B288))","v":"-"}]
[{"$f":"IF(B289=0,\"-\",COUNTA($B$6:B289))","v":"-"}]
[{"$f":"IF(B290=0,\"-\",COUNTA($B$6:B290))","v":"-"}]
[{"$f":"IF(B291=0,\"-\",COUNTA($B$6:B291))","v":"-"}]
[{"$f":"IF(B292=0,\"-\",COUNTA($B$6:B292))","v":"-"}]
[{"$f":"IF(B293=0,\"-\",COUNTA($B$6:B293))","v":"-"}]
[{"$f":"IF(B294=0,\"-\",COUNTA($B$6:B294))","v":"-"}]
[{"$f":"IF(B295=0,\"-\",COUNTA($B$6:B295))","v":"-"}]
[{"$f":"IF(B296=0,\"-\",COUNTA($B$6:B296))","v":"-"}]
[{"$f":"IF(B297=0,\"-\",COUNTA($B$6:B297))","v":"-"}]
[{"$f":"IF(B298=0,\"-\",COUNTA($B$6:B298))","v":"-"}]
[{"$f":"IF(B299=0,\"-\",COUNTA($B$6:B299))","v":"-"}]
[{"$f":"IF(B300=0,\"-\",COUNTA($B$6:B300))","v":"-"}]
[{"$f":"IF(B301=0,\"-\",COUNTA($B$6:B301))","v":"-"}]
[{"$f":"IF(B302=0,\"-\",COUNTA($B$6:B302))","v":"-"}]
[{"$f":"IF(B303=0,\"-\",COUNTA($B$6:B303))","v":"-"}]
[{"$f":"IF(B304=0,\"-\",COUNTA($B$6:B304))","v":"-"}]
[{"$f":"IF(B305=0,\"-\",COUNTA($B$6:B305))","v":"-"}]
[{"$f":"IF(B306=0,\"-\",COUNTA($B$6:B306))","v":"-"}]
[{"$f":"IF(B307=0,\"-\",COUNTA($B$6:B307))","v":"-"}]
[{"$f":"IF(B308=0,\"-\",COUNTA($B$6:B308))","v":"-"}]
[{"$f":"IF(B309=0,\"-\",COUNTA($B$6:B309))","v":"-"}]
[{"$f":"IF(B310=0,\"-\",COUNTA($B$6:B310))","v":"-"}]
[{"$f":"IF(B311=0,\"-\",COUNTA($B$6:B311))","v":"-"}]
[{"$f":"IF(B312=0,\"-\",COUNTA($B$6:B312))","v":"-"}]
[{"$f":"IF(B313=0,\"-\",COUNTA($B$6:B313))","v":"-"}]
[{"$f":"IF(B314=0,\"-\",COUNTA($B$6:B314))","v":"-"}]
[{"$f":"IF(B315=0,\"-\",COUNTA($B$6:B315))","v":"-"}]
[{"$f":"IF(B316=0,\"-\",COUNTA($B$6:B316))","v":"-"}]
[{"$f":"IF(B317=0,\"-\",COUNTA($B$6:B317))","v":"-"}]
[{"$f":"IF(B318=0,\"-\",COUNTA($B$6:B318))","v":"-"}]
[{"$f":"IF(B319=0,\"-\",COUNTA($B$6:B319))","v":"-"}]
[{"$f":"IF(B320=0,\"-\",COUNTA($B$6:B320))","v":"-"}]
[{"$f":"IF(B321=0,\"-\",COUNTA($B$6:B321))","v":"-"}]
[{"$f":"IF(B322=0,\"-\",COUNTA($B$6:B322))","v":"-"}]
[{"$f":"IF(B323=0,\"-\",COUNTA($B$6:B323))","v":"-"}]
[{"$f":"IF(B324=0,\"-\",COUNTA($B$6:B324))","v":"-"}]
[{"$f":"IF(B325=0,\"-\",COUNTA($B$6:B325))","v":"-"}]
[{"$f":"IF(B326=0,\"-\",COUNTA($B$6:B326))","v":"-"}]
[{"$f":"IF(B327=0,\"-\",COUNTA($B$6:B327))","v":"-"}]
[{"$f":"IF(B328=0,\"-\",COUNTA($B$6:B328))","v":"-"}]
[{"$f":"IF(B329=0,\"-\",COUNTA($B$6:B329))","v":"-"}]
[{"$f":"IF(B330=0,\"-\",COUNTA($B$6:B330))","v":"-"}]
[{"$f":"IF(B331=0,\"-\",COUNTA($B$6:B331))","v":"-"}]
[{"$f":"IF(B332=0,\"-\",COUNTA($B$6:B332))","v":"-"}]
[{"$f":"IF(B333=0,\"-\",COUNTA($B$6:B333))","v":"-"}]
[{"$f":"IF(B334=0,\"-\",COUNTA($B$6:B334))","v":"-"}]
[{"$f":"IF(B335=0,\"-\",COUNTA($B$6:B335))","v":"-"}]
[{"$f":"IF(B336=0,\"-\",COUNTA($B$6:B336))","v":"-"}]
[{"$f":"IF(B337=0,\"-\",COUNTA($B$6:B337))","v":"-"}]
[{"$f":"IF(B338=0,\"-\",COUNTA($B$6:B338))","v":"-"}]
[{"$f":"IF(B339=0,\"-\",COUNTA($B$6:B339))","v":"-"}]
[{"$f":"IF(B340=0,\"-\",COUNTA($B$6:B340))","v":"-"}]
[{"$f":"IF(B341=0,\"-\",COUNTA($B$6:B341))","v":"-"}]
[{"$f":"IF(B342=0,\"-\",COUNTA($B$6:B342))","v":"-"}]
[{"$f":"IF(B343=0,\"-\",COUNTA($B$6:B343))","v":"-"}]
[{"$f":"IF(B344=0,\"-\",COUNTA($B$6:B344))","v":"-"}]
[{"$f":"IF(B345=0,\"-\",COUNTA($B$6:B345))","v":"-"}]
[{"$f":"IF(B346=0,\"-\",COUNTA($B$6:B346))","v":"-"}]
[{"$f":"IF(B347=0,\"-\",COUNTA($B$6:B347))","v":"-"}]
[{"$f":"IF(B348=0,\"-\",COUNTA($B$6:B348))","v":"-"}]
[{"$f":"IF(B349=0,\"-\",COUNTA($B$6:B349))","v":"-"}]
[{"$f":"IF(B350=0,\"-\",COUNTA($B$6:B350))","v":"-"}]
[{"$f":"IF(B351=0,\"-\",COUNTA($B$6:B351))","v":"-"}]
[{"$f":"IF(B352=0,\"-\",COUNTA($B$6:B352))","v":"-"}]
[{"$f":"IF(B353=0,\"-\",COUNTA($B$6:B353))","v":"-"}]
[{"$f":"IF(B354=0,\"-\",COUNTA($B$6:B354))","v":"-"}]
[{"$f":"IF(B355=0,\"-\",COUNTA($B$6:B355))","v":"-"}]
[{"$f":"IF(B356=0,\"-\",COUNTA($B$6:B356))","v":"-"}]
[{"$f":"IF(B357=0,\"-\",COUNTA($B$6:B357))","v":"-"}]
[{"$f":"IF(B358=0,\"-\",COUNTA($B$6:B358))","v":"-"}]
[{"$f":"IF(B359=0,\"-\",COUNTA($B$6:B359))","v":"-"}]
[{"$f":"IF(B360=0,\"-\",COUNTA($B$6:B360))","v":"-"}]
[{"$f":"IF(B361=0,\"-\",COUNTA($B$6:B361))","v":"-"}]
[{"$f":"IF(B362=0,\"-\",COUNTA($B$6:B362))","v":"-"}]
[{"$f":"IF(B363=0,\"-\",COUNTA($B$6:B363))","v":"-"}]
[{"$f":"IF(B364=0,\"-\",COUNTA($B$6:B364))","v":"-"}]
[{"$f":"IF(B365=0,\"-\",COUNTA($B$6:B365))","v":"-"}]
[{"$f":"IF(B366=0,\"-\",COUNTA($B$6:B366))","v":"-"}]
[{"$f":"IF(B367=0,\"-\",COUNTA($B$6:B367))","v":"-"}]
[{"$f":"IF(B368=0,\"-\",COUNTA($B$6:B368))","v":"-"}]
[{"$f":"IF(B369=0,\"-\",COUNTA($B$6:B369))","v":"-"}]
[{"$f":"IF(B370=0,\"-\",COUNTA($B$6:B370))","v":"-"}]
[{"$f":"IF(B371=0,\"-\",COUNTA($B$6:B371))","v":"-"}]
[{"$f":"IF(B372=0,\"-\",COUNTA($B$6:B372))","v":"-"}]
[{"$f":"IF(B373=0,\"-\",COUNTA($B$6:B373))","v":"-"}]
[{"$f":"IF(B374=0,\"-\",COUNTA($B$6:B374))","v":"-"}]
[{"$f":"IF(B375=0,\"-\",COUNTA($B$6:B375))","v":"-"}]
[{"$f":"IF(B376=0,\"-\",COUNTA($B$6:B376))","v":"-"}]
[{"$f":"IF(B377=0,\"-\",COUNTA($B$6:B377))","v":"-"}]
[{"$f":"IF(B378=0,\"-\",COUNTA($B$6:B378))","v":"-"}]
[{"$f":"IF(B379=0,\"-\",COUNTA($B$6:B379))","v":"-"}]
[{"$f":"IF(B380=0,\"-\",COUNTA($B$6:B380))","v":"-"}]
[{"$f":"IF(B381=0,\"-\",COUNTA($B$6:B381))","v":"-"}]
[{"$f":"IF(B382=0,\"-\",COUNTA($B$6:B382))","v":"-"}]
[{"$f":"IF(B383=0,\"-\",COUNTA($B$6:B383))","v":"-"}]
[{"$f":"IF(B384=0,\"-\",COUNTA($B$6:B384))","v":"-"}]
[{"$f":"IF(B385=0,\"-\",COUNTA($B$6:B385))","v":"-"}]
[{"$f":"IF(B386=0,\"-\",COUNTA($B$6:B386))","v":"-"}]
[{"$f":"IF(B387=0,\"-\",COUNTA($B$6:B387))","v":"-"}]
[{"$f":"IF(B388=0,\"-\",COUNTA($B$6:B388))","v":"-"}]
[{"$f":"IF(B389=0,\"-\",COUNTA($B$6:B389))","v":"-"}]
[{"$f":"IF(B390=0,\"-\",COUNTA($B$6:B390))","v":"-"}]
[{"$f":"IF(B391=0,\"-\",COUNTA($B$6:B391))","v":"-"}]
[{"$f":"IF(B392=0,\"-\",COUNTA($B$6:B392))","v":"-"}]
[{"$f":"IF(B393=0,\"-\",COUNTA($B$6:B393))","v":"-"}]
[{"$f":"IF(B394=0,\"-\",COUNTA($B$6:B394))","v":"-"}]
[{"$f":"IF(B395=0,\"-\",COUNTA($B$6:B395))","v":"-"}]
[{"$f":"IF(B396=0,\"-\",COUNTA($B$6:B396))","v":"-"}]
[{"$f":"IF(B397=0,\"-\",COUNTA($B$6:B397))","v":"-"}]
[{"$f":"IF(B398=0,\"-\",COUNTA($B$6:B398))","v":"-"}]
[{"$f":"IF(B399=0,\"-\",COUNTA($B$6:B399))","v":"-"}]
[{"$f":"IF(B400=0,\"-\",COUNTA($B$6:B400))","v":"-"}]
[{"$f":"IF(B401=0,\"-\",COUNTA($B$6:B401))","v":"-"}]
[{"$f":"IF(B402=0,\"-\",COUNTA($B$6:B402))","v":"-"}]
[{"$f":"IF(B403=0,\"-\",COUNTA($B$6:B403))","v":"-"}]
[{"$f":"IF(B404=0,\"-\",COUNTA($B$6:B404))","v":"-"}]
[{"$f":"IF(B405=0,\"-\",COUNTA($B$6:B405))","v":"-"}]
[{"$f":"IF(B406=0,\"-\",COUNTA($B$6:B406))","v":"-"}]
[{"$f":"IF(B407=0,\"-\",COUNTA($B$6:B407))","v":"-"}]
[{"$f":"IF(B408=0,\"-\",COUNTA($B$6:B408))","v":"-"}]
[{"$f":"IF(B409=0,\"-\",COUNTA($B$6:B409))","v":"-"}]
[{"$f":"IF(B410=0,\"-\",COUNTA($B$6:B410))","v":"-"}]
[{"$f":"IF(B411=0,\"-\",COUNTA($B$6:B411))","v":"-"}]
[{"$f":"IF(B412=0,\"-\",COUNTA($B$6:B412))","v":"-"}]
[{"$f":"IF(B413=0,\"-\",COUNTA($B$6:B413))","v":"-"}]
[{"$f":"IF(B414=0,\"-\",COUNTA($B$6:B414))","v":"-"}]
[{"$f":"IF(B415=0,\"-\",COUNTA($B$6:B415))","v":"-"}]
[{"$f":"IF(B416=0,\"-\",COUNTA($B$6:B416))","v":"-"}]
[{"$f":"IF(B417=0,\"-\",COUNTA($B$6:B417))","v":"-"}]
[{"$f":"IF(B418=0,\"-\",COUNTA($B$6:B418))","v":"-"}]
[{"$f":"IF(B419=0,\"-\",COUNTA($B$6:B419))","v":"-"}]
[{"$f":"IF(B420=0,\"-\",COUNTA($B$6:B420))","v":"-"}]
[{"$f":"IF(B421=0,\"-\",COUNTA($B$6:B421))","v":"-"}]
[{"$f":"IF(B422=0,\"-\",COUNTA($B$6:B422))","v":"-"}]
[{"$f":"IF(B423=0,\"-\",COUNTA($B$6:B423))","v":"-"}]
[{"$f":"IF(B424=0,\"-\",COUNTA($B$6:B424))","v":"-"}]
[{"$f":"IF(B425=0,\"-\",COUNTA($B$6:B425))","v":"-"}]
[{"$f":"IF(B426=0,\"-\",COUNTA($B$6:B426))","v":"-"}]
[{"$f":"IF(B427=0,\"-\",COUNTA($B$6:B427))","v":"-"}]
[{"$f":"IF(B428=0,\"-\",COUNTA($B$6:B428))","v":"-"}]
[{"$f":"IF(B429=0,\"-\",COUNTA($B$6:B429))","v":"-"}]
[{"$f":"IF(B430=0,\"-\",COUNTA($B$6:B430))","v":"-"}]
[{"$f":"IF(B431=0,\"-\",COUNTA($B$6:B431))","v":"-"}]
[{"$f":"IF(B432=0,\"-\",COUNTA($B$6:B432))","v":"-"}]
[{"$f":"IF(B433=0,\"-\",COUNTA($B$6:B433))","v":"-"}]
[{"$f":"IF(B434=0,\"-\",COUNTA($B$6:B434))","v":"-"}]
[{"$f":"IF(B435=0,\"-\",COUNTA($B$6:B435))","v":"-"}]
[{"$f":"IF(B436=0,\"-\",COUNTA($B$6:B436))","v":"-"}]
[{"$f":"IF(B437=0,\"-\",COUNTA($B$6:B437))","v":"-"}]
[{"$f":"IF(B438=0,\"-\",COUNTA($B$6:B438))","v":"-"}]
[{"$f":"IF(B439=0,\"-\",COUNTA($B$6:B439))","v":"-"}]
[{"$f":"IF(B440=0,\"-\",COUNTA($B$6:B440))","v":"-"}]
[{"$f":"IF(B441=0,\"-\",COUNTA($B$6:B441))","v":"-"}]
[{"$f":"IF(B442=0,\"-\",COUNTA($B$6:B442))","v":"-"}]
[{"$f":"IF(B443=0,\"-\",COUNTA($B$6:B443))","v":"-"}]
[{"$f":"IF(B444=0,\"-\",COUNTA($B$6:B444))","v":"-"}]
[{"$f":"IF(B445=0,\"-\",COUNTA($B$6:B445))","v":"-"}]
[{"$f":"IF(B446=0,\"-\",COUNTA($B$6:B446))","v":"-"}]
[{"$f":"IF(B447=0,\"-\",COUNTA($B$6:B447))","v":"-"}]
[{"$f":"IF(B448=0,\"-\",COUNTA($B$6:B448))","v":"-"}]
[{"$f":"IF(B449=0,\"-\",COUNTA($B$6:B449))","v":"-"}]
[{"$f":"IF(B450=0,\"-\",COUNTA($B$6:B450))","v":"-"}]
[{"$f":"IF(B451=0,\"-\",COUNTA($B$6:B451))","v":"-"}]
[{"$f":"IF(B452=0,\"-\",COUNTA($B$6:B452))","v":"-"}]
[{"$f":"IF(B453=0,\"-\",COUNTA($B$6:B453))","v":"-"}]
[{"$f":"IF(B454=0,\"-\",COUNTA($B$6:B454))","v":"-"}]
[{"$f":"IF(B455=0,\"-\",COUNTA($B$6:B455))","v":"-"}]
[{"$f":"IF(B456=0,\"-\",COUNTA($B$6:B456))","v":"-"}]
[{"$f":"IF(B457=0,\"-\",COUNTA($B$6:B457))","v":"-"}]
[{"$f":"IF(B458=0,\"-\",COUNTA($B$6:B458))","v":"-"}]
[{"$f":"IF(B459=0,\"-\",COUNTA($B$6:B459))","v":"-"}]
[{"$f":"IF(B460=0,\"-\",COUNTA($B$6:B460))","v":"-"}]
[{"$f":"IF(B461=0,\"-\",COUNTA($B$6:B461))","v":"-"}]
[{"$f":"IF(B462=0,\"-\",COUNTA($B$6:B462))","v":"-"}]
[{"$f":"IF(B463=0,\"-\",COUNTA($B$6:B463))","v":"-"}]
[{"$f":"IF(B464=0,\"-\",COUNTA($B$6:B464))","v":"-"}]
[{"$f":"IF(B465=0,\"-\",COUNTA($B$6:B465))","v":"-"}]
[{"$f":"IF(B466=0,\"-\",COUNTA($B$6:B466))","v":"-"}]
[{"$f":"IF(B467=0,\"-\",COUNTA($B$6:B467))","v":"-"}]
[{"$f":"IF(B468=0,\"-\",COUNTA($B$6:B468))","v":"-"}]
[{"$f":"IF(B469=0,\"-\",COUNTA($B$6:B469))","v":"-"}]
[{"$f":"IF(B470=0,\"-\",COUNTA($B$6:B470))","v":"-"}]
[{"$f":"IF(B471=0,\"-\",COUNTA($B$6:B471))","v":"-"}]
[{"$f":"IF(B472=0,\"-\",COUNTA($B$6:B472))","v":"-"}]
[{"$f":"IF(B473=0,\"-\",COUNTA($B$6:B473))","v":"-"}]
[{"$f":"IF(B474=0,\"-\",COUNTA($B$6:B474))","v":"-"}]
[{"$f":"IF(B475=0,\"-\",COUNTA($B$6:B475))","v":"-"}]
[{"$f":"IF(B476=0,\"-\",COUNTA($B$6:B476))","v":"-"}]
[{"$f":"IF(B477=0,\"-\",COUNTA($B$6:B477))","v":"-"}]
[{"$f":"IF(B478=0,\"-\",COUNTA($B$6:B478))","v":"-"}]
[{"$f":"IF(B479=0,\"-\",COUNTA($B$6:B479))","v":"-"}]
[{"$f":"IF(B480=0,\"-\",COUNTA($B$6:B480))","v":"-"}]
[{"$f":"IF(B481=0,\"-\",COUNTA($B$6:B481))","v":"-"}]
[{"$f":"IF(B482=0,\"-\",COUNTA($B$6:B482))","v":"-"}]
[{"$f":"IF(B483=0,\"-\",COUNTA($B$6:B483))","v":"-"}]
[{"$f":"IF(B484=0,\"-\",COUNTA($B$6:B484))","v":"-"}]
[{"$f":"IF(B485=0,\"-\",COUNTA($B$6:B485))","v":"-"}]
[{"$f":"IF(B486=0,\"-\",COUNTA($B$6:B486))","v":"-"}]
[{"$f":"IF(B487=0,\"-\",COUNTA($B$6:B487))","v":"-"}]
[{"$f":"IF(B488=0,\"-\",COUNTA($B$6:B488))","v":"-"}]
[{"$f":"IF(B489=0,\"-\",COUNTA($B$6:B489))","v":"-"}]
[{"$f":"IF(B490=0,\"-\",COUNTA($B$6:B490))","v":"-"}]
[{"$f":"IF(B491=0,\"-\",COUNTA($B$6:B491))","v":"-"}]
[{"$f":"IF(B492=0,\"-\",COUNTA($B$6:B492))","v":"-"}]
[{"$f":"IF(B493=0,\"-\",COUNTA($B$6:B493))","v":"-"}]
[{"$f":"IF(B494=0,\"-\",COUNTA($B$6:B494))","v":"-"}]
[{"$f":"IF(B495=0,\"-\",COUNTA($B$6:B495))","v":"-"}]
[{"$f":"IF(B496=0,\"-\",COUNTA($B$6:B496))","v":"-"}]
[{"$f":"IF(B497=0,\"-\",COUNTA($B$6:B497))","v":"-"}]
[{"$f":"IF(B498=0,\"-\",COUNTA($B$6:B498))","v":"-"}]
[{"$f":"IF(B499=0,\"-\",COUNTA($B$6:B499))","v":"-"}]
[{"$f":"IF(B500=0,\"-\",COUNTA($B$6:B500))","v":"-"}]
[{"$f":"IF(B501=0,\"-\",COUNTA($B$6:B501))","v":"-"}]
[{"$f":"IF(B502=0,\"-\",COUNTA($B$6:B502))","v":"-"}]
[{"$f":"IF(B503=0,\"-\",COUNTA($B$6:B503))","v":"-"}]
[{"$f":"IF(B504=0,\"-\",COUNTA($B$6:B504))","v":"-"}]
[{"$f":"IF(B505=0,\"-\",COUNTA($B$6:B505))","v":"-"}]
[{"$f":"IF(B506=0,\"-\",COUNTA($B$6:B506))","v":"-"}]
[{"$f":"IF(B507=0,\"-\",COUNTA($B$6:B507))","v":"-"}]
[{"$f":"IF(B508=0,\"-\",COUNTA($B$6:B508))","v":"-"}]
[{"$f":"IF(B509=0,\"-\",COUNTA($B$6:B509))","v":"-"}]
[{"$f":"IF(B510=0,\"-\",COUNTA($B$6:B510))","v":"-"}]
[{"$f":"IF(B511=0,\"-\",COUNTA($B$6:B511))","v":"-"}]
[{"$f":"IF(B512=0,\"-\",COUNTA($B$6:B512))","v":"-"}]
[{"$f":"IF(B513=0,\"-\",COUNTA($B$6:B513))","v":"-"}]
[{"$f":"IF(B514=0,\"-\",COUNTA($B$6:B514))","v":"-"}]
[{"$f":"IF(B515=0,\"-\",COUNTA($B$6:B515))","v":"-"}]
[{"$f":"IF(B516=0,\"-\",COUNTA($B$6:B516))","v":"-"}]
[{"$f":"IF(B517=0,\"-\",COUNTA($B$6:B517))","v":"-"}]
[{"$f":"IF(B518=0,\"-\",COUNTA($B$6:B518))","v":"-"}]
[{"$f":"IF(B519=0,\"-\",COUNTA($B$6:B519))","v":"-"}]
[{"$f":"IF(B520=0,\"-\",COUNTA($B$6:B520))","v":"-"}]
[{"$f":"IF(B521=0,\"-\",COUNTA($B$6:B521))","v":"-"}]
[{"$f":"IF(B522=0,\"-\",COUNTA($B$6:B522))","v":"-"}]
[{"$f":"IF(B523=0,\"-\",COUNTA($B$6:B523))","v":"-"}]
[{"$f":"IF(B524=0,\"-\",COUNTA($B$6:B524))","v":"-"}]
[{"$f":"IF(B525=0,\"-\",COUNTA($B$6:B525))","v":"-"}]
[{"$f":"IF(B526=0,\"-\",COUNTA($B$6:B526))","v":"-"}]
[{"$f":"IF(B527=0,\"-\",COUNTA($B$6:B527))","v":"-"}]
[{"$f":"IF(B528=0,\"-\",COUNTA($B$6:B528))","v":"-"}]
[{"$f":"IF(B529=0,\"-\",COUNTA($B$6:B529))","v":"-"}]
[{"$f":"IF(B530=0,\"-\",COUNTA($B$6:B530))","v":"-"}]
[{"$f":"IF(B531=0,\"-\",COUNTA($B$6:B531))","v":"-"}]
[{"$f":"IF(B532=0,\"-\",COUNTA($B$6:B532))","v":"-"}]
[{"$f":"IF(B533=0,\"-\",COUNTA($B$6:B533))","v":"-"}]
[{"$f":"IF(B534=0,\"-\",COUNTA($B$6:B534))","v":"-"}]
[{"$f":"IF(B535=0,\"-\",COUNTA($B$6:B535))","v":"-"}]
[{"$f":"IF(B536=0,\"-\",COUNTA($B$6:B536))","v":"-"}]
[{"$f":"IF(B537=0,\"-\",COUNTA($B$6:B537))","v":"-"}]
[{"$f":"IF(B538=0,\"-\",COUNTA($B$6:B538))","v":"-"}]
[{"$f":"IF(B539=0,\"-\",COUNTA($B$6:B539))","v":"-"}]
[{"$f":"IF(B540=0,\"-\",COUNTA($B$6:B540))","v":"-"}]
[{"$f":"IF(B541=0,\"-\",COUNTA($B$6:B541))","v":"-"}]
[{"$f":"IF(B542=0,\"-\",COUNTA($B$6:B542))","v":"-"}]
[{"$f":"IF(B543=0,\"-\",COUNTA($B$6:B543))","v":"-"}]
[{"$f":"IF(B544=0,\"-\",COUNTA($B$6:B544))","v":"-"}]
[{"$f":"IF(B545=0,\"-\",COUNTA($B$6:B545))","v":"-"}]
[{"$f":"IF(B546=0,\"-\",COUNTA($B$6:B546))","v":"-"}]
[{"$f":"IF(B547=0,\"-\",COUNTA($B$6:B547))","v":"-"}]
[{"$f":"IF(B548=0,\"-\",COUNTA($B$6:B548))","v":"-"}]
[{"$f":"IF(B549=0,\"-\",COUNTA($B$6:B549))","v":"-"}]
[{"$f":"IF(B550=0,\"-\",COUNTA($B$6:B550))","v":"-"}]
[{"$f":"IF(B551=0,\"-\",COUNTA($B$6:B551))","v":"-"}]
[{"$f":"IF(B552=0,\"-\",COUNTA($B$6:B552))","v":"-"}]
[{"$f":"IF(B553=0,\"-\",COUNTA($B$6:B553))","v":"-"}]
[{"$f":"IF(B554=0,\"-\",COUNTA($B$6:B554))","v":"-"}]
[{"$f":"IF(B555=0,\"-\",COUNTA($B$6:B555))","v":"-"}]
[{"$f":"IF(B556=0,\"-\",COUNTA($B$6:B556))","v":"-"}]
[{"$f":"IF(B557=0,\"-\",COUNTA($B$6:B557))","v":"-"}]
[{"$f":"IF(B558=0,\"-\",COUNTA($B$6:B558))","v":"-"}]
[{"$f":"IF(B559=0,\"-\",COUNTA($B$6:B559))","v":"-"}]
[{"$f":"IF(B560=0,\"-\",COUNTA($B$6:B560))","v":"-"}]
[{"$f":"IF(B561=0,\"-\",COUNTA($B$6:B561))","v":"-"}]
[{"$f":"IF(B562=0,\"-\",COUNTA($B$6:B562))","v":"-"}]
[{"$f":"IF(B563=0,\"-\",COUNTA($B$6:B563))","v":"-"}]
[{"$f":"IF(B564=0,\"-\",COUNTA($B$6:B564))","v":"-"}]
[{"$f":"IF(B565=0,\"-\",COUNTA($B$6:B565))","v":"-"}]
[{"$f":"IF(B566=0,\"-\",COUNTA($B$6:B566))","v":"-"}]
[{"$f":"IF(B567=0,\"-\",COUNTA($B$6:B567))","v":"-"}]
[{"$f":"IF(B568=0,\"-\",COUNTA($B$6:B568))","v":"-"}]
[{"$f":"IF(B569=0,\"-\",COUNTA($B$6:B569))","v":"-"}]
[{"$f":"IF(B570=0,\"-\",COUNTA($B$6:B570))","v":"-"}]
[{"$f":"IF(B571=0,\"-\",COUNTA($B$6:B571))","v":"-"}]
[{"$f":"IF(B572=0,\"-\",COUNTA($B$6:B572))","v":"-"}]
[{"$f":"IF(B573=0,\"-\",COUNTA($B$6:B573))","v":"-"}]
[{"$f":"IF(B574=0,\"-\",COUNTA($B$6:B574))","v":"-"}]
[{"$f":"IF(B575=0,\"-\",COUNTA($B$6:B575))","v":"-"}]
[{"$f":"IF(B576=0,\"-\",COUNTA($B$6:B576))","v":"-"}]
[{"$f":"IF(B577=0,\"-\",COUNTA($B$6:B577))","v":"-"}]
[{"$f":"IF(B578=0,\"-\",COUNTA($B$6:B578))","v":"-"}]
[{"$f":"IF(B579=0,\"-\",COUNTA($B$6:B579))","v":"-"}]
[{"$f":"IF(B580=0,\"-\",COUNTA($B$6:B580))","v":"-"}]
[{"$f":"IF(B581=0,\"-\",COUNTA($B$6:B581))","v":"-"}]
[{"$f":"IF(B582=0,\"-\",COUNTA($B$6:B582))","v":"-"}]
[{"$f":"IF(B583=0,\"-\",COUNTA($B$6:B583))","v":"-"}]
[{"$f":"IF(B584=0,\"-\",COUNTA($B$6:B584))","v":"-"}]
[{"$f":"IF(B585=0,\"-\",COUNTA($B$6:B585))","v":"-"}]
[{"$f":"IF(B586=0,\"-\",COUNTA($B$6:B586))","v":"-"}]
[{"$f":"IF(B587=0,\"-\",COUNTA($B$6:B587))","v":"-"}]
[{"$f":"IF(B588=0,\"-\",COUNTA($B$6:B588))","v":"-"}]
[{"$f":"IF(B589=0,\"-\",COUNTA($B$6:B589))","v":"-"}]
[{"$f":"IF(B590=0,\"-\",COUNTA($B$6:B590))","v":"-"}]
[{"$f":"IF(B591=0,\"-\",COUNTA($B$6:B591))","v":"-"}]
[{"$f":"IF(B592=0,\"-\",COUNTA($B$6:B592))","v":"-"}]
[{"$f":"IF(B593=0,\"-\",COUNTA($B$6:B593))","v":"-"}]
[{"$f":"IF(B594=0,\"-\",COUNTA($B$6:B594))","v":"-"}]
[{"$f":"IF(B595=0,\"-\",COUNTA($B$6:B595))","v":"-"}]
[{"$f":"IF(B596=0,\"-\",COUNTA($B$6:B596))","v":"-"}]
[{"$f":"IF(B597=0,\"-\",COUNTA($B$6:B597))","v":"-"}]
[{"$f":"IF(B598=0,\"-\",COUNTA($B$6:B598))","v":"-"}]
[{"$f":"IF(B599=0,\"-\",COUNTA($B$6:B599))","v":"-"}]
[{"$f":"IF(B600=0,\"-\",COUNTA($B$6:B600))","v":"-"}]
[{"$f":"IF(B601=0,\"-\",COUNTA($B$6:B601))","v":"-"}]
[{"$f":"IF(B602=0,\"-\",COUNTA($B$6:B602))","v":"-"}]
[{"$f":"IF(B603=0,\"-\",COUNTA($B$6:B603))","v":"-"}]
[{"$f":"IF(B604=0,\"-\",COUNTA($B$6:B604))","v":"-"}]
[{"$f":"IF(B605=0,\"-\",COUNTA($B$6:B605))","v":"-"}]
[{"$f":"IF(B606=0,\"-\",COUNTA($B$6:B606))","v":"-"}]
[{"$f":"IF(B607=0,\"-\",COUNTA($B$6:B607))","v":"-"}]
[{"$f":"IF(B608=0,\"-\",COUNTA($B$6:B608))","v":"-"}]
[{"$f":"IF(B609=0,\"-\",COUNTA($B$6:B609))","v":"-"}]
[{"$f":"IF(B610=0,\"-\",COUNTA($B$6:B610))","v":"-"}]
[{"$f":"IF(B611=0,\"-\",COUNTA($B$6:B611))","v":"-"}]
[{"$f":"IF(B612=0,\"-\",COUNTA($B$6:B612))","v":"-"}]
[{"$f":"IF(B613=0,\"-\",COUNTA($B$6:B613))","v":"-"}]
[{"$f":"IF(B614=0,\"-\",COUNTA($B$6:B614))","v":"-"}]
[{"$f":"IF(B615=0,\"-\",COUNTA($B$6:B615))","v":"-"}]
[{"$f":"IF(B616=0,\"-\",COUNTA($B$6:B616))","v":"-"}]
[{"$f":"IF(B617=0,\"-\",COUNTA($B$6:B617))","v":"-"}]
[{"$f":"IF(B618=0,\"-\",COUNTA($B$6:B618))","v":"-"}]
[{"$f":"IF(B619=0,\"-\",COUNTA($B$6:B619))","v":"-"}]
[{"$f":"IF(B620=0,\"-\",COUNTA($B$6:B620))","v":"-"}]
[{"$f":"IF(B621=0,\"-\",COUNTA($B$6:B621))","v":"-"}]
[{"$f":"IF(B622=0,\"-\",COUNTA($B$6:B622))","v":"-"}]
[{"$f":"IF(B623=0,\"-\",COUNTA($B$6:B623))","v":"-"}]
[{"$f":"IF(B624=0,\"-\",COUNTA($B$6:B624))","v":"-"}]
[{"$f":"IF(B625=0,\"-\",COUNTA($B$6:B625))","v":"-"}]
[{"$f":"IF(B626=0,\"-\",COUNTA($B$6:B626))","v":"-"}]
[{"$f":"IF(B627=0,\"-\",COUNTA($B$6:B627))","v":"-"}]
[{"$f":"IF(B628=0,\"-\",COUNTA($B$6:B628))","v":"-"}]
[{"$f":"IF(B629=0,\"-\",COUNTA($B$6:B629))","v":"-"}]
[{"$f":"IF(B630=0,\"-\",COUNTA($B$6:B630))","v":"-"}]
[{"$f":"IF(B631=0,\"-\",COUNTA($B$6:B631))","v":"-"}]
[{"$f":"IF(B632=0,\"-\",COUNTA($B$6:B632))","v":"-"}]
[{"$f":"IF(B633=0,\"-\",COUNTA($B$6:B633))","v":"-"}]
[{"$f":"IF(B634=0,\"-\",COUNTA($B$6:B634))","v":"-"}]
[{"$f":"IF(B635=0,\"-\",COUNTA($B$6:B635))","v":"-"}]
[{"$f":"IF(B636=0,\"-\",COUNTA($B$6:B636))","v":"-"}]
[{"$f":"IF(B637=0,\"-\",COUNTA($B$6:B637))","v":"-"}]
[{"$f":"IF(B638=0,\"-\",COUNTA($B$6:B638))","v":"-"}]
[{"$f":"IF(B639=0,\"-\",COUNTA($B$6:B639))","v":"-"}]
[{"$f":"IF(B640=0,\"-\",COUNTA($B$6:B640))","v":"-"}]
[{"$f":"IF(B641=0,\"-\",COUNTA($B$6:B641))","v":"-"}]
[{"$f":"IF(B642=0,\"-\",COUNTA($B$6:B642))","v":"-"}]
[{"$f":"IF(B643=0,\"-\",COUNTA($B$6:B643))","v":"-"}]
[{"$f":"IF(B644=0,\"-\",COUNTA($B$6:B644))","v":"-"}]
[{"$f":"IF(B645=0,\"-\",COUNTA($B$6:B645))","v":"-"}]
[{"$f":"IF(B646=0,\"-\",COUNTA($B$6:B646))","v":"-"}]
[{"$f":"IF(B647=0,\"-\",COUNTA($B$6:B647))","v":"-"}]
[{"$f":"IF(B648=0,\"-\",COUNTA($B$6:B648))","v":"-"}]
[{"$f":"IF(B649=0,\"-\",COUNTA($B$6:B649))","v":"-"}]
[{"$f":"IF(B650=0,\"-\",COUNTA($B$6:B650))","v":"-"}]
[{"$f":"IF(B651=0,\"-\",COUNTA($B$6:B651))","v":"-"}]
[{"$f":"IF(B652=0,\"-\",COUNTA($B$6:B652))","v":"-"}]
[{"$f":"IF(B653=0,\"-\",COUNTA($B$6:B653))","v":"-"}]
[{"$f":"IF(B654=0,\"-\",COUNTA($B$6:B654))","v":"-"}]
[{"$f":"IF(B655=0,\"-\",COUNTA($B$6:B655))","v":"-"}]
[{"$f":"IF(B656=0,\"-\",COUNTA($B$6:B656))","v":"-"}]
[{"$f":"IF(B657=0,\"-\",COUNTA($B$6:B657))","v":"-"}]
[{"$f":"IF(B658=0,\"-\",COUNTA($B$6:B658))","v":"-"}]
[{"$f":"IF(B659=0,\"-\",COUNTA($B$6:B659))","v":"-"}]
[{"$f":"IF(B660=0,\"-\",COUNTA($B$6:B660))","v":"-"}]
[{"$f":"IF(B661=0,\"-\",COUNTA($B$6:B661))","v":"-"}]
[{"$f":"IF(B662=0,\"-\",COUNTA($B$6:B662))","v":"-"}]
[{"$f":"IF(B663=0,\"-\",COUNTA($B$6:B663))","v":"-"}]
[{"$f":"IF(B664=0,\"-\",COUNTA($B$6:B664))","v":"-"}]
[{"$f":"IF(B665=0,\"-\",COUNTA($B$6:B665))","v":"-"}]
[{"$f":"IF(B666=0,\"-\",COUNTA($B$6:B666))","v":"-"}]
[{"$f":"IF(B667=0,\"-\",COUNTA($B$6:B667))","v":"-"}]
[{"$f":"IF(B668=0,\"-\",COUNTA($B$6:B668))","v":"-"}]
[{"$f":"IF(B669=0,\"-\",COUNTA($B$6:B669))","v":"-"}]
[{"$f":"IF(B670=0,\"-\",COUNTA($B$6:B670))","v":"-"}]
[{"$f":"IF(B671=0,\"-\",COUNTA($B$6:B671))","v":"-"}]
[{"$f":"IF(B672=0,\"-\",COUNTA($B$6:B672))","v":"-"}]
[{"$f":"IF(B673=0,\"-\",COUNTA($B$6:B673))","v":"-"}]
[{"$f":"IF(B674=0,\"-\",COUNTA($B$6:B674))","v":"-"}]
[{"$f":"IF(B675=0,\"-\",COUNTA($B$6:B675))","v":"-"}]
[{"$f":"IF(B676=0,\"-\",COUNTA($B$6:B676))","v":"-"}]
[{"$f":"IF(B677=0,\"-\",COUNTA($B$6:B677))","v":"-"}]
[{"$f":"IF(B678=0,\"-\",COUNTA($B$6:B678))","v":"-"}]
[{"$f":"IF(B679=0,\"-\",COUNTA($B$6:B679))","v":"-"}]
[{"$f":"IF(B680=0,\"-\",COUNTA($B$6:B680))","v":"-"}]
[{"$f":"IF(B681=0,\"-\",COUNTA($B$6:B681))","v":"-"}]
[{"$f":"IF(B682=0,\"-\",COUNTA($B$6:B682))","v":"-"}]
[{"$f":"IF(B683=0,\"-\",COUNTA($B$6:B683))","v":"-"}]
[{"$f":"IF(B684=0,\"-\",COUNTA($B$6:B684))","v":"-"}]
[{"$f":"IF(B685=0,\"-\",COUNTA($B$6:B685))","v":"-"}]
[{"$f":"IF(B686=0,\"-\",COUNTA($B$6:B686))","v":"-"}]
[{"$f":"IF(B687=0,\"-\",COUNTA($B$6:B687))","v":"-"}]
[{"$f":"IF(B688=0,\"-\",COUNTA($B$6:B688))","v":"-"}]
[{"$f":"IF(B689=0,\"-\",COUNTA($B$6:B689))","v":"-"}]
[{"$f":"IF(B690=0,\"-\",COUNTA($B$6:B690))","v":"-"}]
[{"$f":"IF(B691=0,\"-\",COUNTA($B$6:B691))","v":"-"}]
[{"$f":"IF(B692=0,\"-\",COUNTA($B$6:B692))","v":"-"}]
[{"$f":"IF(B693=0,\"-\",COUNTA($B$6:B693))","v":"-"}]
[{"$f":"IF(B694=0,\"-\",COUNTA($B$6:B694))","v":"-"}]
[{"$f":"IF(B695=0,\"-\",COUNTA($B$6:B695))","v":"-"}]
[{"$f":"IF(B696=0,\"-\",COUNTA($B$6:B696))","v":"-"}]
[{"$f":"IF(B697=0,\"-\",COUNTA($B$6:B697))","v":"-"}]
[{"$f":"IF(B698=0,\"-\",COUNTA($B$6:B698))","v":"-"}]
[{"$f":"IF(B699=0,\"-\",COUNTA($B$6:B699))","v":"-"}]
[{"$f":"IF(B700=0,\"-\",COUNTA($B$6:B700))","v":"-"}]
[{"$f":"IF(B701=0,\"-\",COUNTA($B$6:B701))","v":"-"}]
[{"$f":"IF(B702=0,\"-\",COUNTA($B$6:B702))","v":"-"}]
[{"$f":"IF(B703=0,\"-\",COUNTA($B$6:B703))","v":"-"}]
[{"$f":"IF(B704=0,\"-\",COUNTA($B$6:B704))","v":"-"}]
[{"$f":"IF(B705=0,\"-\",COUNTA($B$6:B705))","v":"-"}]
[{"$f":"IF(B706=0,\"-\",COUNTA($B$6:B706))","v":"-"}]
[{"$f":"IF(B707=0,\"-\",COUNTA($B$6:B707))","v":"-"}]
[{"$f":"IF(B708=0,\"-\",COUNTA($B$6:B708))","v":"-"}]
[{"$f":"IF(B709=0,\"-\",COUNTA($B$6:B709))","v":"-"}]
[{"$f":"IF(B710=0,\"-\",COUNTA($B$6:B710))","v":"-"}]
[{"$f":"IF(B711=0,\"-\",COUNTA($B$6:B711))","v":"-"}]
[{"$f":"IF(B712=0,\"-\",COUNTA($B$6:B712))","v":"-"}]
[{"$f":"IF(B713=0,\"-\",COUNTA($B$6:B713))","v":"-"}]
[{"$f":"IF(B714=0,\"-\",COUNTA($B$6:B714))","v":"-"}]
[{"$f":"IF(B715=0,\"-\",COUNTA($B$6:B715))","v":"-"}]
[{"$f":"IF(B716=0,\"-\",COUNTA($B$6:B716))","v":"-"}]
[{"$f":"IF(B717=0,\"-\",COUNTA($B$6:B717))","v":"-"}]
[{"$f":"IF(B718=0,\"-\",COUNTA($B$6:B718))","v":"-"}]
[{"$f":"IF(B719=0,\"-\",COUNTA($B$6:B719))","v":"-"}]
[{"$f":"IF(B720=0,\"-\",COUNTA($B$6:B720))","v":"-"}]
[{"$f":"IF(B721=0,\"-\",COUNTA($B$6:B721))","v":"-"}]
[{"$f":"IF(B722=0,\"-\",COUNTA($B$6:B722))","v":"-"}]
[{"$f":"IF(B723=0,\"-\",COUNTA($B$6:B723))","v":"-"}]
[{"$f":"IF(B724=0,\"-\",COUNTA($B$6:B724))","v":"-"}]
[{"$f":"IF(B725=0,\"-\",COUNTA($B$6:B725))","v":"-"}]
[{"$f":"IF(B726=0,\"-\",COUNTA($B$6:B726))","v":"-"}]
[{"$f":"IF(B727=0,\"-\",COUNTA($B$6:B727))","v":"-"}]
[{"$f":"IF(B728=0,\"-\",COUNTA($B$6:B728))","v":"-"}]
[{"$f":"IF(B729=0,\"-\",COUNTA($B$6:B729))","v":"-"}]
[{"$f":"IF(B730=0,\"-\",COUNTA($B$6:B730))","v":"-"}]
[{"$f":"IF(B731=0,\"-\",COUNTA($B$6:B731))","v":"-"}]
[{"$f":"IF(B732=0,\"-\",COUNTA($B$6:B732))","v":"-"}]
[{"$f":"IF(B733=0,\"-\",COUNTA($B$6:B733))","v":"-"}]
[{"$f":"IF(B734=0,\"-\",COUNTA($B$6:B734))","v":"-"}]
[{"$f":"IF(B735=0,\"-\",COUNTA($B$6:B735))","v":"-"}]
[{"$f":"IF(B736=0,\"-\",COUNTA($B$6:B736))","v":"-"}]
[{"$f":"IF(B737=0,\"-\",COUNTA($B$6:B737))","v":"-"}]
[{"$f":"IF(B738=0,\"-\",COUNTA($B$6:B738))","v":"-"}]
[{"$f":"IF(B739=0,\"-\",COUNTA($B$6:B739))","v":"-"}]
[{"$f":"IF(B740=0,\"-\",COUNTA($B$6:B740))","v":"-"}]
[{"$f":"IF(B741=0,\"-\",COUNTA($B$6:B741))","v":"-"}]
[{"$f":"IF(B742=0,\"-\",COUNTA($B$6:B742))","v":"-"}]
[{"$f":"IF(B743=0,\"-\",COUNTA($B$6:B743))","v":"-"}]
[{"$f":"IF(B744=0,\"-\",COUNTA($B$6:B744))","v":"-"}]
[{"$f":"IF(B745=0,\"-\",COUNTA($B$6:B745))","v":"-"}]
[{"$f":"IF(B746=0,\"-\",COUNTA($B$6:B746))","v":"-"}]
[{"$f":"IF(B747=0,\"-\",COUNTA($B$6:B747))","v":"-"}]
[{"$f":"IF(B748=0,\"-\",COUNTA($B$6:B748))","v":"-"}]
[{"$f":"IF(B749=0,\"-\",COUNTA($B$6:B749))","v":"-"}]
[{"$f":"IF(B750=0,\"-\",COUNTA($B$6:B750))","v":"-"}]
[{"$f":"IF(B751=0,\"-\",COUNTA($B$6:B751))","v":"-"}]
[{"$f":"IF(B752=0,\"-\",COUNTA($B$6:B752))","v":"-"}]
[{"$f":"IF(B753=0,\"-\",COUNTA($B$6:B753))","v":"-"}]
[{"$f":"IF(B754=0,\"-\",COUNTA($B$6:B754))","v":"-"}]
[{"$f":"IF(B755=0,\"-\",COUNTA($B$6:B755))","v":"-"}]
[{"$f":"IF(B756=0,\"-\",COUNTA($B$6:B756))","v":"-"}]
[{"$f":"IF(B757=0,\"-\",COUNTA($B$6:B757))","v":"-"}]
[{"$f":"IF(B758=0,\"-\",COUNTA($B$6:B758))","v":"-"}]
[{"$f":"IF(B759=0,\"-\",COUNTA($B$6:B759))","v":"-"}]
[{"$f":"IF(B760=0,\"-\",COUNTA($B$6:B760))","v":"-"}]
[{"$f":"IF(B761=0,\"-\",COUNTA($B$6:B761))","v":"-"}]
[{"$f":"IF(B762=0,\"-\",COUNTA($B$6:B762))","v":"-"}]
[{"$f":"IF(B763=0,\"-\",COUNTA($B$6:B763))","v":"-"}]
[{"$f":"IF(B764=0,\"-\",COUNTA($B$6:B764))","v":"-"}]
[{"$f":"IF(B765=0,\"-\",COUNTA($B$6:B765))","v":"-"}]
[{"$f":"IF(B766=0,\"-\",COUNTA($B$6:B766))","v":"-"}]
[{"$f":"IF(B767=0,\"-\",COUNTA($B$6:B767))","v":"-"}]
[{"$f":"IF(B768=0,\"-\",COUNTA($B$6:B768))","v":"-"}]
[{"$f":"IF(B769=0,\"-\",COUNTA($B$6:B769))","v":"-"}]
[{"$f":"IF(B770=0,\"-\",COUNTA($B$6:B770))","v":"-"}]
[{"$f":"IF(B771=0,\"-\",COUNTA($B$6:B771))","v":"-"}]
[{"$f":"IF(B772=0,\"-\",COUNTA($B$6:B772))","v":"-"}]
[{"$f":"IF(B773=0,\"-\",COUNTA($B$6:B773))","v":"-"}]
[{"$f":"IF(B774=0,\"-\",COUNTA($B$6:B774))","v":"-"}]
[{"$f":"IF(B775=0,\"-\",COUNTA($B$6:B775))","v":"-"}]
[{"$f":"IF(B776=0,\"-\",COUNTA($B$6:B776))","v":"-"}]
[{"$f":"IF(B777=0,\"-\",COUNTA($B$6:B777))","v":"-"}]
[{"$f":"IF(B778=0,\"-\",COUNTA($B$6:B778))","v":"-"}]
[{"$f":"IF(B779=0,\"-\",COUNTA($B$6:B779))","v":"-"}]
[{"$f":"IF(B780=0,\"-\",COUNTA($B$6:B780))","v":"-"}]
[{"$f":"IF(B781=0,\"-\",COUNTA($B$6:B781))","v":"-"}]
[{"$f":"IF(B782=0,\"-\",COUNTA($B$6:B782))","v":"-"}]
[{"$f":"IF(B783=0,\"-\",COUNTA($B$6:B783))","v":"-"}]
[{"$f":"IF(B784=0,\"-\",COUNTA($B$6:B784))","v":"-"}]
[{"$f":"IF(B785=0,\"-\",COUNTA($B$6:B785))","v":"-"}]
[{"$f":"IF(B786=0,\"-\",COUNTA($B$6:B786))","v":"-"}]
[{"$f":"IF(B787=0,\"-\",COUNTA($B$6:B787))","v":"-"}]
[{"$f":"IF(B788=0,\"-\",COUNTA($B$6:B788))","v":"-"}]
[{"$f":"IF(B789=0,\"-\",COUNTA($B$6:B789))","v":"-"}]
[{"$f":"IF(B790=0,\"-\",COUNTA($B$6:B790))","v":"-"}]
[{"$f":"IF(B791=0,\"-\",COUNTA($B$6:B791))","v":"-"}]
[{"$f":"IF(B792=0,\"-\",COUNTA($B$6:B792))","v":"-"}]
[{"$f":"IF(B793=0,\"-\",COUNTA($B$6:B793))","v":"-"}]
[{"$f":"IF(B794=0,\"-\",COUNTA($B$6:B794))","v":"-"}]
[{"$f":"IF(B795=0,\"-\",COUNTA($B$6:B795))","v":"-"}]
[{"$f":"IF(B796=0,\"-\",COUNTA($B$6:B796))","v":"-"}]
[{"$f":"IF(B797=0,\"-\",COUNTA($B$6:B797))","v":"-"}]
[{"$f":"IF(B798=0,\"-\",COUNTA($B$6:B798))","v":"-"}]
[{"$f":"IF(B799=0,\"-\",COUNTA($B$6:B799))","v":"-"}]
[{"$f":"IF(B800=0,\"-\",COUNTA($B$6:B800))","v":"-"}]
[{"$f":"IF(B801=0,\"-\",COUNTA($B$6:B801))","v":"-"}]
[{"$f":"IF(B802=0,\"-\",COUNTA($B$6:B802))","v":"-"}]
[{"$f":"IF(B803=0,\"-\",COUNTA($B$6:B803))","v":"-"}]
[{"$f":"IF(B804=0,\"-\",COUNTA($B$6:B804))","v":"-"}]
[{"$f":"IF(B805=0,\"-\",COUNTA($B$6:B805))","v":"-"}]
[{"$f":"IF(B806=0,\"-\",COUNTA($B$6:B806))","v":"-"}]
[{"$f":"IF(B807=0,\"-\",COUNTA($B$6:B807))","v":"-"}]
[{"$f":"IF(B808=0,\"-\",COUNTA($B$6:B808))","v":"-"}]
[{"$f":"IF(B809=0,\"-\",COUNTA($B$6:B809))","v":"-"}]
[{"$f":"IF(B810=0,\"-\",COUNTA($B$6:B810))","v":"-"}]
[{"$f":"IF(B811=0,\"-\",COUNTA($B$6:B811))","v":"-"}]
[{"$f":"IF(B812=0,\"-\",COUNTA($B$6:B812))","v":"-"}]
[{"$f":"IF(B813=0,\"-\",COUNTA($B$6:B813))","v":"-"}]
[{"$f":"IF(B814=0,\"-\",COUNTA($B$6:B814))","v":"-"}]
[{"$f":"IF(B815=0,\"-\",COUNTA($B$6:B815))","v":"-"}]
[{"$f":"IF(B816=0,\"-\",COUNTA($B$6:B816))","v":"-"}]
[{"$f":"IF(B817=0,\"-\",COUNTA($B$6:B817))","v":"-"}]
[{"$f":"IF(B818=0,\"-\",COUNTA($B$6:B818))","v":"-"}]
[{"$f":"IF(B819=0,\"-\",COUNTA($B$6:B819))","v":"-"}]
[{"$f":"IF(B820=0,\"-\",COUNTA($B$6:B820))","v":"-"}]
[{"$f":"IF(B821=0,\"-\",COUNTA($B$6:B821))","v":"-"}]
[{"$f":"IF(B822=0,\"-\",COUNTA($B$6:B822))","v":"-"}]
[{"$f":"IF(B823=0,\"-\",COUNTA($B$6:B823))","v":"-"}]
[{"$f":"IF(B824=0,\"-\",COUNTA($B$6:B824))","v":"-"}]
[{"$f":"IF(B825=0,\"-\",COUNTA($B$6:B825))","v":"-"}]
[{"$f":"IF(B826=0,\"-\",COUNTA($B$6:B826))","v":"-"}]
[{"$f":"IF(B827=0,\"-\",COUNTA($B$6:B827))","v":"-"}]
[{"$f":"IF(B828=0,\"-\",COUNTA($B$6:B828))","v":"-"}]
[{"$f":"IF(B829=0,\"-\",COUNTA($B$6:B829))","v":"-"}]
[{"$f":"IF(B830=0,\"-\",COUNTA($B$6:B830))","v":"-"}]
[{"$f":"IF(B831=0,\"-\",COUNTA($B$6:B831))","v":"-"}]
[{"$f":"IF(B832=0,\"-\",COUNTA($B$6:B832))","v":"-"}]
[{"$f":"IF(B833=0,\"-\",COUNTA($B$6:B833))","v":"-"}]
[{"$f":"IF(B834=0,\"-\",COUNTA($B$6:B834))","v":"-"}]
[{"$f":"IF(B835=0,\"-\",COUNTA($B$6:B835))","v":"-"}]
[{"$f":"IF(B836=0,\"-\",COUNTA($B$6:B836))","v":"-"}]
[{"$f":"IF(B837=0,\"-\",COUNTA($B$6:B837))","v":"-"}]
[{"$f":"IF(B838=0,\"-\",COUNTA($B$6:B838))","v":"-"}]
[{"$f":"IF(B839=0,\"-\",COUNTA($B$6:B839))","v":"-"}]
[{"$f":"IF(B840=0,\"-\",COUNTA($B$6:B840))","v":"-"}]
[{"$f":"IF(B841=0,\"-\",COUNTA($B$6:B841))","v":"-"}]
[{"$f":"IF(B842=0,\"-\",COUNTA($B$6:B842))","v":"-"}]
[{"$f":"IF(B843=0,\"-\",COUNTA($B$6:B843))","v":"-"}]
[{"$f":"IF(B844=0,\"-\",COUNTA($B$6:B844))","v":"-"}]
[{"$f":"IF(B845=0,\"-\",COUNTA($B$6:B845))","v":"-"}]
[{"$f":"IF(B846=0,\"-\",COUNTA($B$6:B846))","v":"-"}]
[{"$f":"IF(B847=0,\"-\",COUNTA($B$6:B847))","v":"-"}]
[{"$f":"IF(B848=0,\"-\",COUNTA($B$6:B848))","v":"-"}]
[{"$f":"IF(B849=0,\"-\",COUNTA($B$6:B849))","v":"-"}]
[{"$f":"IF(B850=0,\"-\",COUNTA($B$6:B850))","v":"-"}]
[{"$f":"IF(B851=0,\"-\",COUNTA($B$6:B851))","v":"-"}]
[{"$f":"IF(B852=0,\"-\",COUNTA($B$6:B852))","v":"-"}]
[{"$f":"IF(B853=0,\"-\",COUNTA($B$6:B853))","v":"-"}]
[{"$f":"IF(B854=0,\"-\",COUNTA($B$6:B854))","v":"-"}]
[{"$f":"IF(B855=0,\"-\",COUNTA($B$6:B855))","v":"-"}]
[{"$f":"IF(B856=0,\"-\",COUNTA($B$6:B856))","v":"-"}]
[{"$f":"IF(B857=0,\"-\",COUNTA($B$6:B857))","v":"-"}]
[{"$f":"IF(B858=0,\"-\",COUNTA($B$6:B858))","v":"-"}]
[{"$f":"IF(B859=0,\"-\",COUNTA($B$6:B859))","v":"-"}]
[{"$f":"IF(B860=0,\"-\",COUNTA($B$6:B860))","v":"-"}]
[{"$f":"IF(B861=0,\"-\",COUNTA($B$6:B861))","v":"-"}]
[{"$f":"IF(B862=0,\"-\",COUNTA($B$6:B862))","v":"-"}]
[{"$f":"IF(B863=0,\"-\",COUNTA($B$6:B863))","v":"-"}]
[{"$f":"IF(B864=0,\"-\",COUNTA($B$6:B864))","v":"-"}]
[{"$f":"IF(B865=0,\"-\",COUNTA($B$6:B865))","v":"-"}]
[{"$f":"IF(B866=0,\"-\",COUNTA($B$6:B866))","v":"-"}]
[{"$f":"IF(B867=0,\"-\",COUNTA($B$6:B867))","v":"-"}]
[{"$f":"IF(B868=0,\"-\",COUNTA($B$6:B868))","v":"-"}]
[{"$f":"IF(B869=0,\"-\",COUNTA($B$6:B869))","v":"-"}]
[{"$f":"IF(B870=0,\"-\",COUNTA($B$6:B870))","v":"-"}]
[{"$f":"IF(B871=0,\"-\",COUNTA($B$6:B871))","v":"-"}]
[{"$f":"IF(B872=0,\"-\",COUNTA($B$6:B872))","v":"-"}]
[{"$f":"IF(B873=0,\"-\",COUNTA($B$6:B873))","v":"-"}]
[{"$f":"IF(B874=0,\"-\",COUNTA($B$6:B874))","v":"-"}]
[{"$f":"IF(B875=0,\"-\",COUNTA($B$6:B875))","v":"-"}]
[{"$f":"IF(B876=0,\"-\",COUNTA($B$6:B876))","v":"-"}]
[{"$f":"IF(B877=0,\"-\",COUNTA($B$6:B877))","v":"-"}]
[{"$f":"IF(B878=0,\"-\",COUNTA($B$6:B878))","v":"-"}]
[{"$f":"IF(B879=0,\"-\",COUNTA($B$6:B879))","v":"-"}]
[{"$f":"IF(B880=0,\"-\",COUNTA($B$6:B880))","v":"-"}]
[{"$f":"IF(B881=0,\"-\",COUNTA($B$6:B881))","v":"-"}]
[{"$f":"IF(B882=0,\"-\",COUNTA($B$6:B882))","v":"-"}]
[{"$f":"IF(B883=0,\"-\",COUNTA($B$6:B883))","v":"-"}]
[{"$f":"IF(B884=0,\"-\",COUNTA($B$6:B884))","v":"-"}]
[{"$f":"IF(B885=0,\"-\",COUNTA($B$6:B885))","v":"-"}]
[{"$f":"IF(B886=0,\"-\",COUNTA($B$6:B886))","v":"-"}]
[{"$f":"IF(B887=0,\"-\",COUNTA($B$6:B887))","v":"-"}]
[{"$f":"IF(B888=0,\"-\",COUNTA($B$6:B888))","v":"-"}]
[{"$f":"IF(B889=0,\"-\",COUNTA($B$6:B889))","v":"-"}]
[{"$f":"IF(B890=0,\"-\",COUNTA($B$6:B890))","v":"-"}]
[{"$f":"IF(B891=0,\"-\",COUNTA($B$6:B891))","v":"-"}]
[{"$f":"IF(B892=0,\"-\",COUNTA($B$6:B892))","v":"-"}]
[{"$f":"IF(B893=0,\"-\",COUNTA($B$6:B893))","v":"-"}]
[{"$f":"IF(B894=0,\"-\",COUNTA($B$6:B894))","v":"-"}]
[{"$f":"IF(B895=0,\"-\",COUNTA($B$6:B895))","v":"-"}]
[{"$f":"IF(B896=0,\"-\",COUNTA($B$6:B896))","v":"-"}]
[{"$f":"IF(B897=0,\"-\",COUNTA($B$6:B897))","v":"-"}]
[{"$f":"IF(B898=0,\"-\",COUNTA($B$6:B898))","v":"-"}]
[{"$f":"IF(B899=0,\"-\",COUNTA($B$6:B899))","v":"-"}]
[{"$f":"IF(B900=0,\"-\",COUNTA($B$6:B900))","v":"-"}]
[{"$f":"IF(B901=0,\"-\",COUNTA($B$6:B901))","v":"-"}]
[{"$f":"IF(B902=0,\"-\",COUNTA($B$6:B902))","v":"-"}]
[{"$f":"IF(B903=0,\"-\",COUNTA($B$6:B903))","v":"-"}]
[{"$f":"IF(B904=0,\"-\",COUNTA($B$6:B904))","v":"-"}]
[{"$f":"IF(B905=0,\"-\",COUNTA($B$6:B905))","v":"-"}]
[{"$f":"IF(B906=0,\"-\",COUNTA($B$6:B906))","v":"-"}]
[{"$f":"IF(B907=0,\"-\",COUNTA($B$6:B907))","v":"-"}]
[{"$f":"IF(B908=0,\"-\",COUNTA($B$6:B908))","v":"-"}]
[{"$f":"IF(B909=0,\"-\",COUNTA($B$6:B909))","v":"-"}]
[{"$f":"IF(B910=0,\"-\",COUNTA($B$6:B910))","v":"-"}]
[{"$f":"IF(B911=0,\"-\",COUNTA($B$6:B911))","v":"-"}]
[{"$f":"IF(B912=0,\"-\",COUNTA($B$6:B912))","v":"-"}]
[{"$f":"IF(B913=0,\"-\",COUNTA($B$6:B913))","v":"-"}]
[{"$f":"IF(B914=0,\"-\",COUNTA($B$6:B914))","v":"-"}]
[{"$f":"IF(B915=0,\"-\",COUNTA($B$6:B915))","v":"-"}]
[{"$f":"IF(B916=0,\"-\",COUNTA($B$6:B916))","v":"-"}]
[{"$f":"IF(B917=0,\"-\",COUNTA($B$6:B917))","v":"-"}]
[{"$f":"IF(B918=0,\"-\",COUNTA($B$6:B918))","v":"-"}]
[{"$f":"IF(B919=0,\"-\",COUNTA($B$6:B919))","v":"-"}]
[{"$f":"IF(B920=0,\"-\",COUNTA($B$6:B920))","v":"-"}]
[{"$f":"IF(B921=0,\"-\",COUNTA($B$6:B921))","v":"-"}]
[{"$f":"IF(B922=0,\"-\",COUNTA($B$6:B922))","v":"-"}]
[{"$f":"IF(B923=0,\"-\",COUNTA($B$6:B923))","v":"-"}]
[{"$f":"IF(B924=0,\"-\",COUNTA($B$6:B924))","v":"-"}]
[{"$f":"IF(B925=0,\"-\",COUNTA($B$6:B925))","v":"-"}]
[{"$f":"IF(B926=0,\"-\",COUNTA($B$6:B926))","v":"-"}]
[{"$f":"IF(B927=0,\"-\",COUNTA($B$6:B927))","v":"-"}]
[{"$f":"IF(B928=0,\"-\",COUNTA($B$6:B928))","v":"-"}]
[{"$f":"IF(B929=0,\"-\",COUNTA($B$6:B929))","v":"-"}]
[{"$f":"IF(B930=0,\"-\",COUNTA($B$6:B930))","v":"-"}]
[{"$f":"IF(B931=0,\"-\",COUNTA($B$6:B931))","v":"-"}]
[{"$f":"IF(B932=0,\"-\",COUNTA($B$6:B932))","v":"-"}]
[{"$f":"IF(B933=0,\"-\",COUNTA($B$6:B933))","v":"-"}]
[{"$f":"IF(B934=0,\"-\",COUNTA($B$6:B934))","v":"-"}]
[{"$f":"IF(B935=0,\"-\",COUNTA($B$6:B935))","v":"-"}]
[{"$f":"IF(B936=0,\"-\",COUNTA($B$6:B936))","v":"-"}]
[{"$f":"IF(B937=0,\"-\",COUNTA($B$6:B937))","v":"-"}]
[{"$f":"IF(B938=0,\"-\",COUNTA($B$6:B938))","v":"-"}]
[{"$f":"IF(B939=0,\"-\",COUNTA($B$6:B939))","v":"-"}]
[{"$f":"IF(B940=0,\"-\",COUNTA($B$6:B940))","v":"-"}]
[{"$f":"IF(B941=0,\"-\",COUNTA($B$6:B941))","v":"-"}]
[{"$f":"IF(B942=0,\"-\",COUNTA($B$6:B942))","v":"-"}]
[{"$f":"IF(B943=0,\"-\",COUNTA($B$6:B943))","v":"-"}]
[{"$f":"IF(B944=0,\"-\",COUNTA($B$6:B944))","v":"-"}]
[{"$f":"IF(B945=0,\"-\",COUNTA($B$6:B945))","v":"-"}]
[{"$f":"IF(B946=0,\"-\",COUNTA($B$6:B946))","v":"-"}]
[{"$f":"IF(B947=0,\"-\",COUNTA($B$6:B947))","v":"-"}]
[{"$f":"IF(B948=0,\"-\",COUNTA($B$6:B948))","v":"-"}]
[{"$f":"IF(B949=0,\"-\",COUNTA($B$6:B949))","v":"-"}]
[{"$f":"IF(B950=0,\"-\",COUNTA($B$6:B950))","v":"-"}]
[{"$f":"IF(B951=0,\"-\",COUNTA($B$6:B951))","v":"-"}]
[{"$f":"IF(B952=0,\"-\",COUNTA($B$6:B952))","v":"-"}]
[{"$f":"IF(B953=0,\"-\",COUNTA($B$6:B953))","v":"-"}]
[{"$f":"IF(B954=0,\"-\",COUNTA($B$6:B954))","v":"-"}]
[{"$f":"IF(B955=0,\"-\",COUNTA($B$6:B955))","v":"-"}]
[{"$f":"IF(B956=0,\"-\",COUNTA($B$6:B956))","v":"-"}]
[{"$f":"IF(B957=0,\"-\",COUNTA($B$6:B957))","v":"-"}]
[{"$f":"IF(B958=0,\"-\",COUNTA($B$6:B958))","v":"-"}]
[{"$f":"IF(B959=0,\"-\",COUNTA($B$6:B959))","v":"-"}]
[{"$f":"IF(B960=0,\"-\",COUNTA($B$6:B960))","v":"-"}]
[{"$f":"IF(B961=0,\"-\",COUNTA($B$6:B961))","v":"-"}]
[{"$f":"IF(B962=0,\"-\",COUNTA($B$6:B962))","v":"-"}]
[{"$f":"IF(B963=0,\"-\",COUNTA($B$6:B963))","v":"-"}]
[{"$f":"IF(B964=0,\"-\",COUNTA($B$6:B964))","v":"-"}]
[{"$f":"IF(B965=0,\"-\",COUNTA($B$6:B965))","v":"-"}]
[{"$f":"IF(B966=0,\"-\",COUNTA($B$6:B966))","v":"-"}]
[{"$f":"IF(B967=0,\"-\",COUNTA($B$6:B967))","v":"-"}]
[{"$f":"IF(B968=0,\"-\",COUNTA($B$6:B968))","v":"-"}]
[{"$f":"IF(B969=0,\"-\",COUNTA($B$6:B969))","v":"-"}]
[{"$f":"IF(B970=0,\"-\",COUNTA($B$6:B970))","v":"-"}]
[{"$f":"IF(B971=0,\"-\",COUNTA($B$6:B971))","v":"-"}]
[{"$f":"IF(B972=0,\"-\",COUNTA($B$6:B972))","v":"-"}]
[{"$f":"IF(B973=0,\"-\",COUNTA($B$6:B973))","v":"-"}]
[{"$f":"IF(B974=0,\"-\",COUNTA($B$6:B974))","v":"-"}]
[{"$f":"IF(B975=0,\"-\",COUNTA($B$6:B975))","v":"-"}]
[{"$f":"IF(B976=0,\"-\",COUNTA($B$6:B976))","v":"-"}]
[{"$f":"IF(B977=0,\"-\",COUNTA($B$6:B977))","v":"-"}]
[{"$f":"IF(B978=0,\"-\",COUNTA($B$6:B978))","v":"-"}]
[{"$f":"IF(B979=0,\"-\",COUNTA($B$6:B979))","v":"-"}]
[{"$f":"IF(B980=0,\"-\",COUNTA($B$6:B980))","v":"-"}]
[{"$f":"IF(B981=0,\"-\",COUNTA($B$6:B981))","v":"-"}]
[{"$f":"IF(B982=0,\"-\",COUNTA($B$6:B982))","v":"-"}]
[{"$f":"IF(B983=0,\"-\",COUNTA($B$6:B983))","v":"-"}]
[{"$f":"IF(B984=0,\"-\",COUNTA($B$6:B984))","v":"-"}]
[{"$f":"IF(B985=0,\"-\",COUNTA($B$6:B985))","v":"-"}]
[{"$f":"IF(B986=0,\"-\",COUNTA($B$6:B986))","v":"-"}]
[{"$f":"IF(B987=0,\"-\",COUNTA($B$6:B987))","v":"-"}]
[{"$f":"IF(B988=0,\"-\",COUNTA($B$6:B988))","v":"-"}]
[{"$f":"IF(B989=0,\"-\",COUNTA($B$6:B989))","v":"-"}]
[{"$f":"IF(B990=0,\"-\",COUNTA($B$6:B990))","v":"-"}]
[{"$f":"IF(B991=0,\"-\",COUNTA($B$6:B991))","v":"-"}]
[{"$f":"IF(B992=0,\"-\",COUNTA($B$6:B992))","v":"-"}]
[{"$f":"IF(B993=0,\"-\",COUNTA($B$6:B993))","v":"-"}]
[{"$f":"IF(B994=0,\"-\",COUNTA($B$6:B994))","v":"-"}]
[{"$f":"IF(B995=0,\"-\",COUNTA($B$6:B995))","v":"-"}]
[{"$f":"IF(B996=0,\"-\",COUNTA($B$6:B996))","v":"-"}]
[{"$f":"IF(B997=0,\"-\",COUNTA($B$6:B997))","v":"-"}]
[{"$f":"IF(B998=0,\"-\",COUNTA($B$6:B998))","v":"-"}]
[{"$f":"IF(B999=0,\"-\",COUNTA($B$6:B999))","v":"-"}]
[{"$f":"IF(B1000=0,\"-\",COUNTA($B$6:B1000))","v":"-"}]

{"sheet":"Kwitansi-1","index":3,"n_rows":266,"n_cols":18,"rows_kept":266,"cut":false,"hidden":false,"merged":[[260,6,260,7],[260,9,260,11],[263,3,266,3],[263,6,263,15],[264,6,264,15],[265,6,265,15],[243,0,244,0],[244,3,261,3],[244,5,244,18],[249,11,249,17],[250,6,250,7],[251,11,252,17],[252,6,252,7],[253,6,253,7],[254,11,256,17],[259,17,263,17],[233,6,233,7],[233,9,233,11],[236,3,239,3],[236,6,236,15],[237,6,237,15],[238,6,238,15],[216,0,217,0],[217,3,234,3],[217,5,217,18],[222,11,222,17],[223,6,223,7],[224,11,225,17],[225,6,225,7],[226,6,226,7],[227,11,229,17],[232,17,236,17],[206,6,206,7],[206,9,206,11],[209,3,212,3],[209,6,209,15],[210,6,210,15],[211,6,211,15],[189,0,190,0],[190,3,207,3],[190,5,190,18],[195,11,195,17],[196,6,196,7],[197,11,198,17],[198,6,198,7],[199,6,199,7],[200,11,202,17],[205,17,209,17],[179,6,179,7],[179,9,179,11],[182,3,185,3],[182,6,182,15],[183,6,183,15],[184,6,184,15],[162,0,163,0],[163,3,180,3],[163,5,163,18],[168,11,168,17],[169,6,169,7],[170,11,171,17],[171,6,171,7],[172,6,172,7],[173,11,175,17],[178,17,182,17],[152,6,152,7],[152,9,152,11],[155,3,158,3],[155,6,155,15],[156,6,156,15],[157,6,157,15],[135,0,136,0],[136,3,153,3],[136,5,136,18],[141,11,141,17],[142,6,142,7],[143,11,144,17],[144,6,144,7],[145,6,145,7],[146,11,148,17],[151,17,155,17],[125,6,125,7],[125,9,125,11],[128,3,131,3],[128,6,128,15],[129,6,129,15],[130,6,130,15],[108,0,109,0],[109,3,126,3],[109,5,109,18],[114,11,114,17],[115,6,115,7],[116,11,117,17],[117,6,117,7],[118,6,118,7],[119,11,121,17],[124,17,128,17],[98,6,98,7],[98,9,98,11],[101,3,104,3],[101,6,101,15],[102,6,102,15],[103,6,103,15],[81,0,82,0],[82,3,99,3],[82,5,82,18],[87,11,87,17],[88,6,88,7],[89,11,90,17],[90,6,90,7],[91,6,91,7],[92,11,94,17],[97,17,101,17],[71,6,71,7],[71,9,71,11],[74,3,77,3],[74,6,74,15],[75,6,75,15],[76,6,76,15],[54,0,55,0],[55,3,72,3],[55,5,55,18],[60,11,60,17],[61,6,61,7],[62,11,63,17],[63,6,63,7],[64,6,64,7],[65,11,67,17],[70,17,74,17],[45,6,45,7],[45,9,45,11],[48,3,51,3],[48,6,48,15],[49,6,49,15],[50,6,50,15],[28,0,29,0],[29,3,46,3],[29,5,29,18],[34,11,34,17],[35,6,35,7],[36,11,37,17],[37,6,37,7],[38,6,38,7],[39,11,41,17],[44,17,48,17],[18,6,18,7],[18,9,18,11],[21,3,24,3],[21,6,21,15],[22,6,22,15],[23,6,23,15],[1,0,2,0],[2,3,19,3],[2,5,2,18],[7,11,7,17],[8,6,8,7],[9,11,10,17],[10,6,10,7],[11,6,11,7],[12,11,14,17],[17,17,21,17]]}
[]
[1]
[null,null,null,{"$f":"Nama","v":"PT. KEMBANG SEPATU"},null,"K W I T A N S I"]
[]
[]
[null,null,null,null,null,null,"Nomor :",{"$f":"IF(ISNA(VLOOKUP(A2,Data,O.3,FALSE)),\"...............\",IF(VLOOKUP(A2,Data,O.3,FALSE)=VALUE,\"...............\",VLOOKUP(A2,Data,O.3,FALSE)))","v":"KWT-0001"}]
[]
[null,null,null,null,null,null,"Telah terima dari",null,null,null,":",{"$f":"IF(ISNA(VLOOKUP(A2,Data,O.2,FALSE)),\"...................................\",IF(VLOOKUP(A2,Data,O.2,FALSE)=VALUE,\"...................................\",VLOOKUP(A2,Data,O.2,FALSE)))","v":"Customer 001"}]
[]
[null,null,null,null,null,null,"Uang sejumlah",null,null,null,":",{"$f":"IF(J19=\"....................\",\".................................................................................................................................................................................................................................\",\"# \"&PROPER(Terb01&\" rupiah\")&\" #\")","v":"# Lima Juta Rupiah #"}]
[]
[]
[null,null,null,null,null,null,"Untuk pembayaran",null,null,null,":",{"$f":"IF(ISNA(VLOOKUP(A2,Data,O.6,FALSE)),\".................................................................................................................................................................................................................................\",IF(VLOOKUP(A2,Data,O.6,FALSE)=VALUE,\".................................................................................................................................................................................................................................\",VLOOKUP(A2,Data,O.6,FALSE)))","v":"Pembayaran piutang"}]
[]
[]
[]
[null,null,null,null,null,null,null,null,null,null,null,null,null,null,null,null,null,{"$f":"Kota&\", \"&IF(ISNA(VLOOKUP(A2,Data,O.1,FALSE)),\"..............................\",IF(VLOOKUP(A2,Data,O.1,FALSE)=VALUE,\"..............................\",TEXT(VLOOKUP(A2,Data,O.1,FALSE),\"dd mmmm yyy\")))","v":"Surabaya, 01 Januari 2019"}]
[null,null,null,null,null,null,null,null,null,null,null,null,null,null,null,null,null,"MATERAI"]
[null,null,null,null,null,null,"Jumlah  Rp.",null,null,{"$f":"IF(ISNA(VLOOKUP(A2,Data,O.4,FALSE)),\"....................\",IF(VLOOKUP(A2,Data,O.4,FALSE)=VALUE,\"....................\",VLOOKUP(A2,Data,O.4,FALSE)))","v":5000000}]
[]
[]
[null,null,null,null,null,null,{"$f":"Keterangan_1","v":"Pembayaran dianggap sah setelah masuk rekening kami :"}]
[null,null,null,null,null,null,{"$f":"Keterangan_2","v":"- BCA 00.0000.0000 a/n PT. Kembang Sepatu"},null,null,null,null,null,null,null,null,null,null,{"$f":"IF(ISNA(VLOOKUP(A2,Data,O.7,FALSE)),\".......................\",IF(VLOOKUP(A2,Data,O.7,FALSE)=VALUE,\".......................\",VLOOKUP(A2,Data,O.7,FALSE)))","v":"Muhammad"}]
[null,null,null,null,null,null,{"$f":"Keterangan_3","v":"- MANDIRI 00.0000.000 a/n PT. Kembang Sepatu"},null,null,null,null,null,null,null,null,null,null,{"$f":"IF(ISNA(VLOOKUP(A2,Data,O.8,FALSE)),\"..............................\",IF(VLOOKUP(A2,Data,O.8,FALSE)=VALUE,\"..............................\",VLOOKUP(A2,Data,O.8,FALSE)))","v":"Direktur"}]
[]
[]
[]
[]
[1]
[null,null,null,{"$f":"Nama","v":"PT. KEMBANG SEPATU"},null,"K W I T A N S I"]
[]
[]
[null,null,null,null,null,null,"Nomor :",{"$f":"IF(ISNA(VLOOKUP(A29,Data,O.3,FALSE)),\"...............\",IF(VLOOKUP(A29,Data,O.3,FALSE)=VALUE,\"...............\",VLOOKUP(A29,Data,O.3,FALSE)))","v":"KWT-0001"}]
[]
[null,null,null,null,null,null,"Telah terima dari",null,null,null,":",{"$f":"IF(ISNA(VLOOKUP(A29,Data,O.2,FALSE)),\"...................................\",IF(VLOOKUP(A29,Data,O.2,FALSE)=VALUE,\"...................................\",VLOOKUP(A29,Data,O.2,FALSE)))","v":"Customer 001"}]
[]
[null,null,null,null,null,null,"Uang sejumlah",null,null,null,":",{"$f":"IF(J46=\"....................\",\".................................................................................................................................................................................................................................\",\"# \"&PROPER(Terb02&\" rupiah\")&\" #\")","v":"# Lima Juta Rupiah #"}]
[]
[]
[null,null,null,null,null,null,"Untuk pembayaran",null,null,null,":",{"$f":"IF(ISNA(VLOOKUP(A29,Data,O.6,FALSE)),\".................................................................................................................................................................................................................................\",IF(VLOOKUP(A29,Data,O.6,FALSE)=VALUE,\".................................................................................................................................................................................................................................\",VLOOKUP(A29,Data,O.6,FALSE)))","v":"Pembayaran piutang"}]
[]
[]
[]
[null,null,null,null,null,null,null,null,null,null,null,null,null,null,null,null,null,{"$f":"Kota&\", \"&IF(ISNA(VLOOKUP(A29,Data,O.1,FALSE)),\"..............................\",IF(VLOOKUP(A29,Data,O.1,FALSE)=VALUE,\"..............................\",TEXT(VLOOKUP(A29,Data,O.1,FALSE),\"dd mmmm yyy\")))","v":"Surabaya, 01 Januari 2019"}]
[null,null,null,null,null,null,null,null,null,null,null,null,null,null,null,null,null,"MATERAI"]
[null,null,null,null,null,null,"Jumlah  Rp.",null,null,{"$f":"IF(ISNA(VLOOKUP(A29,Data,O.4,FALSE)),\"....................\",IF(VLOOKUP(A29,Data,O.4,FALSE)=VALUE,\"....................\",VLOOKUP(A29,Data,O.4,FALSE)))","v":5000000}]
[]
[]
[null,null,null,null,null,null,{"$f":"Keterangan_1","v":"Pembayaran dianggap sah setelah masuk rekening kami :"}]
[null,null,null,null,null,null,{"$f":"Keterangan_2","v":"- BCA 00.0000.0000 a/n PT. Kembang Sepatu"},null,null,null,null,null,null,null,null,null,null,{"$f":"IF(ISNA(VLOOKUP(A29,Data,O.7,FALSE)),\".......................\",IF(VLOOKUP(A29,Data,O.7,FALSE)=VALUE,\".......................\",VLOOKUP(A29,Data,O.7,FALSE)))","v":"Muhammad"}]
[null,null,null,null,null,null,{"$f":"Keterangan_3","v":"- MANDIRI 00.0000.000 a/n PT. Kembang Sepatu"},null,null,null,null,null,null,null,null,null,null,{"$f":"IF(ISNA(VLOOKUP(A29,Data,O.8,FALSE)),\"..............................\",IF(VLOOKUP(A29,Data,O.8,FALSE)=VALUE,\"..............................\",VLOOKUP(A29,Data,O.8,FALSE)))","v":"Direktur"}]
[]
[]
[]
[1]
[null,null,null,{"$f":"Nama","v":"PT. KEMBANG SEPATU"},null,"K W I T A N S I"]
[]
[]
[null,null,null,null,null,null,"Nomor :",{"$f":"IF(ISNA(VLOOKUP(A55,Data,O.3,FALSE)),\"...............\",IF(VLOOKUP(A55,Data,O.3,FALSE)=VALUE,\"...............\",VLOOKUP(A55,Data,O.3,FALSE)))","v":"KWT-0001"}]
[]
[null,null,null,null,null,null,"Telah terima dari",null,null,null,":",{"$f":"IF(ISNA(VLOOKUP(A55,Data,O.2,FALSE)),\"...................................\",IF(VLOOKUP(A55,Data,O.2,FALSE)=VALUE,\"...................................\",VLOOKUP(A55,Data,O.2,FALSE)))","v":"Customer 001"}]
[]
[null,null,null,null,null,null,"Uang sejumlah",null,null,null,":",{"$f":"IF(J72=\"....................\",\".................................................................................................................................................................................................................................\",\"# \"&PROPER(Terb03&\" rupiah\")&\" #\")","v":"# Lima Juta Rupiah #"}]
[]
[]
[null,null,null,null,null,null,"Untuk pembayaran",null,null,null,":",{"$f":"IF(ISNA(VLOOKUP(A55,Data,O.6,FALSE)),\".................................................................................................................................................................................................................................\",IF(VLOOKUP(A55,Data,O.6,FALSE)=VALUE,\".................................................................................................................................................................................................................................\",VLOOKUP(A55,Data,O.6,FALSE)))","v":"Pembayaran piutang"}]
[]
[]
[]
[null,null,null,null,null,null,null,null,null,null,null,null,null,null,null,null,null,{"$f":"Kota&\", \"&IF(ISNA(VLOOKUP(A55,Data,O.1,FALSE)),\"..............................\",IF(VLOOKUP(A55,Data,O.1,FALSE)=VALUE,\"..............................\",TEXT(VLOOKUP(A55,Data,O.1,FALSE),\"dd mmmm yyy\")))","v":"Surabaya, 01 Januari 2019"}]
[null,null,null,null,null,null,null,null,null,null,null,null,null,null,null,null,null,"MATERAI"]
[null,null,null,null,null,null,"Jumlah  Rp.",null,null,{"$f":"IF(ISNA(VLOOKUP(A55,Data,O.4,FALSE)),\"....................\",IF(VLOOKUP(A55,Data,O.4,FALSE)=VALUE,\"....................\",VLOOKUP(A55,Data,O.4,FALSE)))","v":5000000}]
[]
[]
[null,null,null,null,null,null,{"$f":"Keterangan_1","v":"Pembayaran dianggap sah setelah masuk rekening kami :"}]
[null,null,null,null,null,null,{"$f":"Keterangan_2","v":"- BCA 00.0000.0000 a/n PT. Kembang Sepatu"},null,null,null,null,null,null,null,null,null,null,{"$f":"IF(ISNA(VLOOKUP(A55,Data,O.7,FALSE)),\".......................\",IF(VLOOKUP(A55,Data,O.7,FALSE)=VALUE,\".......................\",VLOOKUP(A55,Data,O.7,FALSE)))","v":"Muhammad"}]
[null,null,null,null,null,null,{"$f":"Keterangan_3","v":"- MANDIRI 00.0000.000 a/n PT. Kembang Sepatu"},null,null,null,null,null,null,null,null,null,null,{"$f":"IF(ISNA(VLOOKUP(A55,Data,O.8,FALSE)),\"..............................\",IF(VLOOKUP(A55,Data,O.8,FALSE)=VALUE,\"..............................\",VLOOKUP(A55,Data,O.8,FALSE)))","v":"Direktur"}]
[]
[]
[]
[]
[1]
[null,null,null,{"$f":"Nama","v":"PT. KEMBANG SEPATU"},null,"K W I T A N S I"]
[]
[]
[null,null,null,null,null,null,"Nomor :",{"$f":"IF(ISNA(VLOOKUP(A82,Data,O.3,FALSE)),\"...............\",IF(VLOOKUP(A82,Data,O.3,FALSE)=VALUE,\"...............\",VLOOKUP(A82,Data,O.3,FALSE)))","v":"KWT-0001"}]
[]
[null,null,null,null,null,null,"Telah terima dari",null,null,null,":",{"$f":"IF(ISNA(VLOOKUP(A82,Data,O.2,FALSE)),\"...................................\",IF(VLOOKUP(A82,Data,O.2,FALSE)=VALUE,\"...................................\",VLOOKUP(A82,Data,O.2,FALSE)))","v":"Customer 001"}]
[]
[null,null,null,null,null,null,"Uang sejumlah",null,null,null,":",{"$f":"IF(J99=\"....................\",\".................................................................................................................................................................................................................................\",\"# \"&PROPER(Terb04&\" rupiah\")&\" #\")","v":"# Lima Juta Rupiah #"}]
[]
[]
[null,null,null,null,null,null,"Untuk pembayaran",null,null,null,":",{"$f":"IF(ISNA(VLOOKUP(A82,Data,O.6,FALSE)),\".................................................................................................................................................................................................................................\",IF(VLOOKUP(A82,Data,O.6,FALSE)=VALUE,\".................................................................................................................................................................................................................................\",VLOOKUP(A82,Data,O.6,FALSE)))","v":"Pembayaran piutang"}]
[]
[]
[]
[null,null,null,null,null,null,null,null,null,null,null,null,null,null,null,null,null,{"$f":"Kota&\", \"&IF(ISNA(VLOOKUP(A82,Data,O.1,FALSE)),\"..............................\",IF(VLOOKUP(A82,Data,O.1,FALSE)=VALUE,\"..............................\",TEXT(VLOOKUP(A82,Data,O.1,FALSE),\"dd mmmm yyy\")))","v":"Surabaya, 01 Januari 2019"}]
[null,null,null,null,null,null,null,null,null,null,null,null,null,null,null,null,null,"MATERAI"]
[null,null,null,null,null,null,"Jumlah  Rp.",null,null,{"$f":"IF(ISNA(VLOOKUP(A82,Data,O.4,FALSE)),\"....................\",IF(VLOOKUP(A82,Data,O.4,FALSE)=VALUE,\"....................\",VLOOKUP(A82,Data,O.4,FALSE)))","v":5000000}]
[]
[]
[null,null,null,null,null,null,{"$f":"Keterangan_1","v":"Pembayaran dianggap sah setelah masuk rekening kami :"}]
[null,null,null,null,null,null,{"$f":"Keterangan_2","v":"- BCA 00.0000.0000 a/n PT. Kembang Sepatu"},null,null,null,null,null,null,null,null,null,null,{"$f":"IF(ISNA(VLOOKUP(A82,Data,O.7,FALSE)),\".......................\",IF(VLOOKUP(A82,Data,O.7,FALSE)=VALUE,\".......................\",VLOOKUP(A82,Data,O.7,FALSE)))","v":"Muhammad"}]
[null,null,null,null,null,null,{"$f":"Keterangan_3","v":"- MANDIRI 00.0000.000 a/n PT. Kembang Sepatu"},null,null,null,null,null,null,null,null,null,null,{"$f":"IF(ISNA(VLOOKUP(A82,Data,O.8,FALSE)),\"..............................\",IF(VLOOKUP(A82,Data,O.8,FALSE)=VALUE,\"..............................\",VLOOKUP(A82,Data,O.8,FALSE)))","v":"Direktur"}]
[]
[]
[]
[]
[1]
[null,null,null,{"$f":"Nama","v":"PT. KEMBANG SEPATU"},null,"K W I T A N S I"]
[]
[]
[null,null,null,null,null,null,"Nomor :",{"$f":"IF(ISNA(VLOOKUP(A109,Data,O.3,FALSE)),\"...............\",IF(VLOOKUP(A109,Data,O.3,FALSE)=VALUE,\"...............\",VLOOKUP(A109,Data,O.3,FALSE)))","v":"KWT-0001"}]
[]
[null,null,null,null,null,null,"Telah terima dari",null,null,null,":",{"$f":"IF(ISNA(VLOOKUP(A109,Data,O.2,FALSE)),\"...................................\",IF(VLOOKUP(A109,Data,O.2,FALSE)=VALUE,\"...................................\",VLOOKUP(A109,Data,O.2,FALSE)))","v":"Customer 001"}]
[]
[null,null,null,null,null,null,"Uang sejumlah",null,null,null,":",{"$f":"IF(J126=\"....................\",\".................................................................................................................................................................................................................................\",\"# \"&PROPER(Terb05&\" rupiah\")&\" #\")","v":"# Lima Juta Rupiah #"}]
[]
[]
[null,null,null,null,null,null,"Untuk pembayaran",null,null,null,":",{"$f":"IF(ISNA(VLOOKUP(A109,Data,O.6,FALSE)),\".................................................................................................................................................................................................................................\",IF(VLOOKUP(A109,Data,O.6,FALSE)=VALUE,\".................................................................................................................................................................................................................................\",VLOOKUP(A109,Data,O.6,FALSE)))","v":"Pembayaran piutang"}]
[]
[]
[]
[null,null,null,null,null,null,null,null,null,null,null,null,null,null,null,null,null,{"$f":"Kota&\", \"&IF(ISNA(VLOOKUP(A109,Data,O.1,FALSE)),\"..............................\",IF(VLOOKUP(A109,Data,O.1,FALSE)=VALUE,\"..............................\",TEXT(VLOOKUP(A109,Data,O.1,FALSE),\"dd mmmm yyy\")))","v":"Surabaya, 01 Januari 2019"}]
[null,null,null,null,null,null,null,null,null,null,null,null,null,null,null,null,null,"MATERAI"]
[null,null,null,null,null,null,"Jumlah  Rp.",null,null,{"$f":"IF(ISNA(VLOOKUP(A109,Data,O.4,FALSE)),\"....................\",IF(VLOOKUP(A109,Data,O.4,FALSE)=VALUE,\"....................\",VLOOKUP(A109,Data,O.4,FALSE)))","v":5000000}]
[]
[]
[null,null,null,null,null,null,{"$f":"Keterangan_1","v":"Pembayaran dianggap sah setelah masuk rekening kami :"}]
[null,null,null,null,null,null,{"$f":"Keterangan_2","v":"- BCA 00.0000.0000 a/n PT. Kembang Sepatu"},null,null,null,null,null,null,null,null,null,null,{"$f":"IF(ISNA(VLOOKUP(A109,Data,O.7,FALSE)),\".......................\",IF(VLOOKUP(A109,Data,O.7,FALSE)=VALUE,\".......................\",VLOOKUP(A109,Data,O.7,FALSE)))","v":"Muhammad"}]
[null,null,null,null,null,null,{"$f":"Keterangan_3","v":"- MANDIRI 00.0000.000 a/n PT. Kembang Sepatu"},null,null,null,null,null,null,null,null,null,null,{"$f":"IF(ISNA(VLOOKUP(A109,Data,O.8,FALSE)),\"..............................\",IF(VLOOKUP(A109,Data,O.8,FALSE)=VALUE,\"..............................\",VLOOKUP(A109,Data,O.8,FALSE)))","v":"Direktur"}]
[]
[]
[]
[]
[1]
[null,null,null,{"$f":"Nama","v":"PT. KEMBANG SEPATU"},null,"K W I T A N S I"]
[]
[]
[null,null,null,null,null,null,"Nomor :",{"$f":"IF(ISNA(VLOOKUP(A136,Data,O.3,FALSE)),\"...............\",IF(VLOOKUP(A136,Data,O.3,FALSE)=VALUE,\"...............\",VLOOKUP(A136,Data,O.3,FALSE)))","v":"KWT-0001"}]
[]
[null,null,null,null,null,null,"Telah terima dari",null,null,null,":",{"$f":"IF(ISNA(VLOOKUP(A136,Data,O.2,FALSE)),\"...................................\",IF(VLOOKUP(A136,Data,O.2,FALSE)=VALUE,\"...................................\",VLOOKUP(A136,Data,O.2,FALSE)))","v":"Customer 001"}]
[]
[null,null,null,null,null,null,"Uang sejumlah",null,null,null,":",{"$f":"IF(J153=\"....................\",\".................................................................................................................................................................................................................................\",\"# \"&PROPER(Terb06&\" rupiah\")&\" #\")","v":"# Lima Juta Rupiah #"}]
[]
[]
[null,null,null,null,null,null,"Untuk pembayaran",null,null,null,":",{"$f":"IF(ISNA(VLOOKUP(A136,Data,O.6,FALSE)),\".................................................................................................................................................................................................................................\",IF(VLOOKUP(A136,Data,O.6,FALSE)=VALUE,\".................................................................................................................................................................................................................................\",VLOOKUP(A136,Data,O.6,FALSE)))","v":"Pembayaran piutang"}]
[]
[]
[]
[null,null,null,null,null,null,null,null,null,null,null,null,null,null,null,null,null,{"$f":"Kota&\", \"&IF(ISNA(VLOOKUP(A136,Data,O.1,FALSE)),\"..............................\",IF(VLOOKUP(A136,Data,O.1,FALSE)=VALUE,\"..............................\",TEXT(VLOOKUP(A136,Data,O.1,FALSE),\"dd mmmm yyy\")))","v":"Surabaya, 01 Januari 2019"}]
[null,null,null,null,null,null,null,null,null,null,null,null,null,null,null,null,null,"MATERAI"]
[null,null,null,null,null,null,"Jumlah  Rp.",null,null,{"$f":"IF(ISNA(VLOOKUP(A136,Data,O.4,FALSE)),\"....................\",IF(VLOOKUP(A136,Data,O.4,FALSE)=VALUE,\"....................\",VLOOKUP(A136,Data,O.4,FALSE)))","v":5000000}]
[]
[]
[null,null,null,null,null,null,{"$f":"Keterangan_1","v":"Pembayaran dianggap sah setelah masuk rekening kami :"}]
[null,null,null,null,null,null,{"$f":"Keterangan_2","v":"- BCA 00.0000.0000 a/n PT. Kembang Sepatu"},null,null,null,null,null,null,null,null,null,null,{"$f":"IF(ISNA(VLOOKUP(A136,Data,O.7,FALSE)),\".......................\",IF(VLOOKUP(A136,Data,O.7,FALSE)=VALUE,\".......................\",VLOOKUP(A136,Data,O.7,FALSE)))","v":"Muhammad"}]
[null,null,null,null,null,null,{"$f":"Keterangan_3","v":"- MANDIRI 00.0000.000 a/n PT. Kembang Sepatu"},null,null,null,null,null,null,null,null,null,null,{"$f":"IF(ISNA(VLOOKUP(A136,Data,O.8,FALSE)),\"..............................\",IF(VLOOKUP(A136,Data,O.8,FALSE)=VALUE,\"..............................\",VLOOKUP(A136,Data,O.8,FALSE)))","v":"Direktur"}]
[]
[]
[]
[]
[1]
[null,null,null,{"$f":"Nama","v":"PT. KEMBANG SEPATU"},null,"K W I T A N S I"]
[]
[]
[null,null,null,null,null,null,"Nomor :",{"$f":"IF(ISNA(VLOOKUP(A163,Data,O.3,FALSE)),\"...............\",IF(VLOOKUP(A163,Data,O.3,FALSE)=VALUE,\"...............\",VLOOKUP(A163,Data,O.3,FALSE)))","v":"KWT-0001"}]
[]
[null,null,null,null,null,null,"Telah terima dari",null,null,null,":",{"$f":"IF(ISNA(VLOOKUP(A163,Data,O.2,FALSE)),\"...................................\",IF(VLOOKUP(A163,Data,O.2,FALSE)=VALUE,\"...................................\",VLOOKUP(A163,Data,O.2,FALSE)))","v":"Customer 001"}]
[]
[null,null,null,null,null,null,"Uang sejumlah",null,null,null,":",{"$f":"IF(J180=\"....................\",\".................................................................................................................................................................................................................................\",\"# \"&PROPER(Terb07&\" rupiah\")&\" #\")","v":"# Lima Juta Rupiah #"}]
[]
[]
[null,null,null,null,null,null,"Untuk pembayaran",null,null,null,":",{"$f":"IF(ISNA(VLOOKUP(A163,Data,O.6,FALSE)),\".................................................................................................................................................................................................................................\",IF(VLOOKUP(A163,Data,O.6,FALSE)=VALUE,\".................................................................................................................................................................................................................................\",VLOOKUP(A163,Data,O.6,FALSE)))","v":"Pembayaran piutang"}]
[]
[]
[]
[null,null,null,null,null,null,null,null,null,null,null,null,null,null,null,null,null,{"$f":"Kota&\", \"&IF(ISNA(VLOOKUP(A163,Data,O.1,FALSE)),\"..............................\",IF(VLOOKUP(A163,Data,O.1,FALSE)=VALUE,\"..............................\",TEXT(VLOOKUP(A163,Data,O.1,FALSE),\"dd mmmm yyy\")))","v":"Surabaya, 01 Januari 2019"}]
[null,null,null,null,null,null,null,null,null,null,null,null,null,null,null,null,null,"MATERAI"]
[null,null,null,null,null,null,"Jumlah  Rp.",null,null,{"$f":"IF(ISNA(VLOOKUP(A163,Data,O.4,FALSE)),\"....................\",IF(VLOOKUP(A163,Data,O.4,FALSE)=VALUE,\"....................\",VLOOKUP(A163,Data,O.4,FALSE)))","v":5000000}]
[]
[]
[null,null,null,null,null,null,{"$f":"Keterangan_1","v":"Pembayaran dianggap sah setelah masuk rekening kami :"}]
[null,null,null,null,null,null,{"$f":"Keterangan_2","v":"- BCA 00.0000.0000 a/n PT. Kembang Sepatu"},null,null,null,null,null,null,null,null,null,null,{"$f":"IF(ISNA(VLOOKUP(A163,Data,O.7,FALSE)),\".......................\",IF(VLOOKUP(A163,Data,O.7,FALSE)=VALUE,\".......................\",VLOOKUP(A163,Data,O.7,FALSE)))","v":"Muhammad"}]
[null,null,null,null,null,null,{"$f":"Keterangan_3","v":"- MANDIRI 00.0000.000 a/n PT. Kembang Sepatu"},null,null,null,null,null,null,null,null,null,null,{"$f":"IF(ISNA(VLOOKUP(A163,Data,O.8,FALSE)),\"..............................\",IF(VLOOKUP(A163,Data,O.8,FALSE)=VALUE,\"..............................\",VLOOKUP(A163,Data,O.8,FALSE)))","v":"Direktur"}]
[]
[]
[]
[]
[1]
[null,null,null,{"$f":"Nama","v":"PT. KEMBANG SEPATU"},null,"K W I T A N S I"]
[]
[]
[null,null,null,null,null,null,"Nomor :",{"$f":"IF(ISNA(VLOOKUP(A190,Data,O.3,FALSE)),\"...............\",IF(VLOOKUP(A190,Data,O.3,FALSE)=VALUE,\"...............\",VLOOKUP(A190,Data,O.3,FALSE)))","v":"KWT-0001"}]
[]
[null,null,null,null,null,null,"Telah terima dari",null,null,null,":",{"$f":"IF(ISNA(VLOOKUP(A190,Data,O.2,FALSE)),\"...................................\",IF(VLOOKUP(A190,Data,O.2,FALSE)=VALUE,\"...................................\",VLOOKUP(A190,Data,O.2,FALSE)))","v":"Customer 001"}]
[]
[null,null,null,null,null,null,"Uang sejumlah",null,null,null,":",{"$f":"IF(J207=\"....................\",\".................................................................................................................................................................................................................................\",\"# \"&PROPER(Terb08&\" rupiah\")&\" #\")","v":"# Lima Juta Rupiah #"}]
[]
[]
[null,null,null,null,null,null,"Untuk pembayaran",null,null,null,":",{"$f":"IF(ISNA(VLOOKUP(A190,Data,O.6,FALSE)),\".................................................................................................................................................................................................................................\",IF(VLOOKUP(A190,Data,O.6,FALSE)=VALUE,\".................................................................................................................................................................................................................................\",VLOOKUP(A190,Data,O.6,FALSE)))","v":"Pembayaran piutang"}]
[]
[]
[]
[null,null,null,null,null,null,null,null,null,null,null,null,null,null,null,null,null,{"$f":"Kota&\", \"&IF(ISNA(VLOOKUP(A190,Data,O.1,FALSE)),\"..............................\",IF(VLOOKUP(A190,Data,O.1,FALSE)=VALUE,\"..............................\",TEXT(VLOOKUP(A190,Data,O.1,FALSE),\"dd mmmm yyy\")))","v":"Surabaya, 01 Januari 2019"}]
[null,null,null,null,null,null,null,null,null,null,null,null,null,null,null,null,null,"MATERAI"]
[null,null,null,null,null,null,"Jumlah  Rp.",null,null,{"$f":"IF(ISNA(VLOOKUP(A190,Data,O.4,FALSE)),\"....................\",IF(VLOOKUP(A190,Data,O.4,FALSE)=VALUE,\"....................\",VLOOKUP(A190,Data,O.4,FALSE)))","v":5000000}]
[]
[]
[null,null,null,null,null,null,{"$f":"Keterangan_1","v":"Pembayaran dianggap sah setelah masuk rekening kami :"}]
[null,null,null,null,null,null,{"$f":"Keterangan_2","v":"- BCA 00.0000.0000 a/n PT. Kembang Sepatu"},null,null,null,null,null,null,null,null,null,null,{"$f":"IF(ISNA(VLOOKUP(A190,Data,O.7,FALSE)),\".......................\",IF(VLOOKUP(A190,Data,O.7,FALSE)=VALUE,\".......................\",VLOOKUP(A190,Data,O.7,FALSE)))","v":"Muhammad"}]
[null,null,null,null,null,null,{"$f":"Keterangan_3","v":"- MANDIRI 00.0000.000 a/n PT. Kembang Sepatu"},null,null,null,null,null,null,null,null,null,null,{"$f":"IF(ISNA(VLOOKUP(A190,Data,O.8,FALSE)),\"..............................\",IF(VLOOKUP(A190,Data,O.8,FALSE)=VALUE,\"..............................\",VLOOKUP(A190,Data,O.8,FALSE)))","v":"Direktur"}]
[]
[]
[]
[]
[4]
[null,null,null,{"$f":"Nama","v":"PT. KEMBANG SEPATU"},null,"K W I T A N S I"]
[]
[]
[null,null,null,null,null,null,"Nomor :",{"$f":"IF(ISNA(VLOOKUP(A217,Data,O.3,FALSE)),\"...............\",IF(VLOOKUP(A217,Data,O.3,FALSE)=VALUE,\"...............\",VLOOKUP(A217,Data,O.3,FALSE)))","v":"KWT-0004"}]
[]
[null,null,null,null,null,null,"Telah terima dari",null,null,null,":",{"$f":"IF(ISNA(VLOOKUP(A217,Data,O.2,FALSE)),\"...................................\",IF(VLOOKUP(A217,Data,O.2,FALSE)=VALUE,\"...................................\",VLOOKUP(A217,Data,O.2,FALSE)))","v":"Customer 004"}]
[]
[null,null,null,null,null,null,"Uang sejumlah",null,null,null,":",{"$f":"IF(J234=\"....................\",\".................................................................................................................................................................................................................................\",\"# \"&PROPER(Terb09&\" rupiah\")&\" #\")","v":"# Enam Juta Rupiah #"}]
[]
[]
[null,null,null,null,null,null,"Untuk pembayaran",null,null,null,":",{"$f":"IF(ISNA(VLOOKUP(A217,Data,O.6,FALSE)),\".................................................................................................................................................................................................................................\",IF(VLOOKUP(A217,Data,O.6,FALSE)=VALUE,\".................................................................................................................................................................................................................................\",VLOOKUP(A217,Data,O.6,FALSE)))","v":"Pembayaran piutang"}]
[]
[]
[]
[null,null,null,null,null,null,null,null,null,null,null,null,null,null,null,null,null,{"$f":"Kota&\", \"&IF(ISNA(VLOOKUP(A217,Data,O.1,FALSE)),\"..............................\",IF(VLOOKUP(A217,Data,O.1,FALSE)=VALUE,\"..............................\",TEXT(VLOOKUP(A217,Data,O.1,FALSE),\"dd mmmm yyy\")))","v":"Surabaya, 09 Januari 2019"}]
[null,null,null,null,null,null,null,null,null,null,null,null,null,null,null,null,null,"MATERAI"]
[null,null,null,null,null,null,"Jumlah  Rp.",null,null,{"$f":"IF(ISNA(VLOOKUP(A217,Data,O.4,FALSE)),\"....................\",IF(VLOOKUP(A217,Data,O.4,FALSE)=VALUE,\"....................\",VLOOKUP(A217,Data,O.4,FALSE)))","v":6000000}]
[]
[]
[null,null,null,null,null,null,{"$f":"Keterangan_1","v":"Pembayaran dianggap sah setelah masuk rekening kami :"}]
[null,null,null,null,null,null,{"$f":"Keterangan_2","v":"- BCA 00.0000.0000 a/n PT. Kembang Sepatu"},null,null,null,null,null,null,null,null,null,null,{"$f":"IF(ISNA(VLOOKUP(A217,Data,O.7,FALSE)),\".......................\",IF(VLOOKUP(A217,Data,O.7,FALSE)=VALUE,\".......................\",VLOOKUP(A217,Data,O.7,FALSE)))","v":"Muhammad"}]
[null,null,null,null,null,null,{"$f":"Keterangan_3","v":"- MANDIRI 00.0000.000 a/n PT. Kembang Sepatu"},null,null,null,null,null,null,null,null,null,null,{"$f":"IF(ISNA(VLOOKUP(A217,Data,O.8,FALSE)),\"..............................\",IF(VLOOKUP(A217,Data,O.8,FALSE)=VALUE,\"..............................\",VLOOKUP(A217,Data,O.8,FALSE)))","v":"Direktur"}]
[]
[]
[]
[]
[9]
[null,null,null,{"$f":"Nama","v":"PT. KEMBANG SEPATU"},null,"K W I T A N S I"]
[]
[]
[null,null,null,null,null,null,"Nomor :",{"$f":"IF(ISNA(VLOOKUP(A244,Data,O.3,FALSE)),\"...............\",IF(VLOOKUP(A244,Data,O.3,FALSE)=VALUE,\"...............\",VLOOKUP(A244,Data,O.3,FALSE)))","v":"KWT-0009"}]
[]
[null,null,null,null,null,null,"Telah terima dari",null,null,null,":",{"$f":"IF(ISNA(VLOOKUP(A244,Data,O.2,FALSE)),\"...................................\",IF(VLOOKUP(A244,Data,O.2,FALSE)=VALUE,\"...................................\",VLOOKUP(A244,Data,O.2,FALSE)))","v":"Customer 009"}]
[]
[null,null,null,null,null,null,"Uang sejumlah",null,null,null,":",{"$f":"IF(J261=\"....................\",\".................................................................................................................................................................................................................................\",\"# \"&PROPER(Terb10&\" rupiah\")&\" #\")","v":"# Sembilan Juta Rupiah #"}]
[]
[]
[null,null,null,null,null,null,"Untuk pembayaran",null,null,null,":",{"$f":"IF(ISNA(VLOOKUP(A244,Data,O.6,FALSE)),\".................................................................................................................................................................................................................................\",IF(VLOOKUP(A244,Data,O.6,FALSE)=VALUE,\".................................................................................................................................................................................................................................\",VLOOKUP(A244,Data,O.6,FALSE)))","v":"Pembayaran piutang"}]
[]
[]
[]
[null,null,null,null,null,null,null,null,null,null,null,null,null,null,null,null,null,{"$f":"Kota&\", \"&IF(ISNA(VLOOKUP(A244,Data,O.1,FALSE)),\"..............................\",IF(VLOOKUP(A244,Data,O.1,FALSE)=VALUE,\"..............................\",TEXT(VLOOKUP(A244,Data,O.1,FALSE),\"dd mmmm yyy\")))","v":"Surabaya, 25 Januari 2019"}]
[null,null,null,null,null,null,null,null,null,null,null,null,null,null,null,null,null,"MATERAI"]
[null,null,null,null,null,null,"Jumlah  Rp.",null,null,{"$f":"IF(ISNA(VLOOKUP(A244,Data,O.4,FALSE)),\"....................\",IF(VLOOKUP(A244,Data,O.4,FALSE)=VALUE,\"....................\",VLOOKUP(A244,Data,O.4,FALSE)))","v":9000000}]
[]
[]
[null,null,null,null,null,null,{"$f":"Keterangan_1","v":"Pembayaran dianggap sah setelah masuk rekening kami :"}]
[null,null,null,null,null,null,{"$f":"Keterangan_2","v":"- BCA 00.0000.0000 a/n PT. Kembang Sepatu"},null,null,null,null,null,null,null,null,null,null,{"$f":"IF(ISNA(VLOOKUP(A244,Data,O.7,FALSE)),\".......................\",IF(VLOOKUP(A244,Data,O.7,FALSE)=VALUE,\".......................\",VLOOKUP(A244,Data,O.7,FALSE)))","v":"Ahmadi"}]
[null,null,null,null,null,null,{"$f":"Keterangan_3","v":"- MANDIRI 00.0000.000 a/n PT. Kembang Sepatu"},null,null,null,null,null,null,null,null,null,null,{"$f":"IF(ISNA(VLOOKUP(A244,Data,O.8,FALSE)),\"..............................\",IF(VLOOKUP(A244,Data,O.8,FALSE)=VALUE,\"..............................\",VLOOKUP(A244,Data,O.8,FALSE)))","v":"Manajer"}]

{"sheet":"Kwitansi-2","index":4,"n_rows":317,"n_cols":12,"rows_kept":317,"cut":false,"hidden":false,"merged":[[315,4,315,9],[316,4,316,9],[301,4,301,6],[302,8,303,11],[303,4,303,6],[304,4,304,6],[305,8,307,11],[310,11,314,11],[311,4,311,5],[311,6,311,8],[314,4,314,9],[283,4,283,9],[284,4,284,9],[289,0,290,0],[297,4,297,11],[298,4,298,11],[300,8,300,11],[269,4,269,6],[270,8,271,11],[271,4,271,6],[272,4,272,6],[273,8,275,11],[278,11,282,11],[279,4,279,5],[279,6,279,8],[282,4,282,9],[251,4,251,9],[252,4,252,9],[257,0,258,0],[265,4,265,11],[266,4,266,11],[268,8,268,11],[237,4,237,6],[238,8,239,11],[239,4,239,6],[240,4,240,6],[241,8,243,11],[246,11,250,11],[247,4,247,5],[247,6,247,8],[250,4,250,9],[219,4,219,9],[220,4,220,9],[225,0,226,0],[233,4,233,11],[234,4,234,11],[236,8,236,11],[205,4,205,6],[206,8,207,11],[207,4,207,6],[208,4,208,6],[209,8,211,11],[214,11,218,11],[215,4,215,5],[215,6,215,8],[218,4,218,9],[187,4,187,9],[188,4,188,9],[193,0,194,0],[201,4,201,11],[202,4,202,11],[204,8,204,11],[173,4,173,6],[174,8,175,11],[175,4,175,6],[176,4,176,6],[177,8,179,11],[182,11,186,11],[183,4,183,5],[183,6,183,8],[186,4,186,9],[155,4,155,9],[156,4,156,9],[161,0,162,0],[169,4,169,11],[170,4,170,11],[172,8,172,11],[141,4,141,6],[142,8,143,11],[143,4,143,6],[144,4,144,6],[145,8,147,11],[150,11,154,11],[151,4,151,5],[151,6,151,8],[154,4,154,9],[123,4,123,9],[124,4,124,9],[129,0,130,0],[137,4,137,11],[138,4,138,11],[140,8,140,11],[109,4,109,6],[110,8,111,11],[111,4,111,6],[112,4,112,6],[113,8,115,11],[118,11,122,11],[119,4,119,5],[119,6,119,8],[122,4,122,9],[91,4,91,9],[92,4,92,9],[97,0,98,0],[105,4,105,11],[106,4,106,11],[108,8,108,11],[77,4,77,6],[78,8,79,11],[79,4,79,6],[80,4,80,6],[81,8,83,11],[86,11,90,11],[87,4,87,5],[87,6,87,8],[90,4,90,9],[59,4,59,9],[60,4,60,9],[65,0,66,0],[73,4,73,11],[74,4,74,11],[76,8,76,11],[45,4,45,6],[46,8,47,11],[47,4,47,6],[48,4,48,6],[49,8,51,11],[54,11,58,11],[55,4,55,5],[55,6,55,8],[58,4,58,9],[33,0,34,0],[41,4,41,11],[42,4,42,11],[44,8,44,11],[16,4,16,6],[17,8,19,11],[22,11,26,11],[23,4,23,5],[23,6,23,8],[26,4,26,9],[1,0,2,0],[9,4,9,11],[10,4,10,11],[12,8,12,11],[13,4,13,6],[14,8,15,11],[15,4,15,6],[27,4,27,9],[28,4,28,9]]}
[]
[1]
[]
[null,null,null,null,null,{"$f":"Nama","v":"PT. KEMBANG SEPATU"}]
[null,null,null,null,null,{"$f":"Alamat","v":"Jl. Macan Kumbang No. 20, Perak, Surabaya"}]
[null,null,null,null,null,{"$f":"\"Telpon / Fax : \"&Telpon","v":"Telpon / Fax : (031) 700100"}]
[null,null,null,null,null,{"$f":"\"Email : \"&email","v":"Email : pt_kembang.s@yahoo.com"}]
[]
[]
[null,null,null,null,"K W I T A N S I"]
[null,null,null,null,{"$f":"\"Nomor : \"&IF(ISNA(VLOOKUP(A2,Data,O.3,FALSE)),\"...............\",IF(VLOOKUP(A2,Data,O.3,FALSE)=VALUE,\"...............\",VLOOKUP(A2,Data,O.3,FALSE)))","v":"Nomor : KWT-0001"}]
[]
[null,null,null,null,"Telah terima dari",null,null,":",{"$f":"IF(ISNA(VLOOKUP(A2,Data,O.2,FALSE)),\"...................................\",IF(VLOOKUP(A2,Data,O.2,FALSE)=VALUE,\"...................................\",VLOOKUP(A2,Data,O.2,FALSE)))","v":"Customer 001"}]
[]
[null,null,null,null,"Uang sejumlah",null,null,":",{"$f":"IF(G24=\"....................\",\".................................................................................................................................................................................................................................\",\"# \"&PROPER(Terb11&\" rupiah\")&\" #\")","v":"# Lima Juta Rupiah #"}]
[]
[]
[null,null,null,null,"Untuk pembayaran",null,null,":",{"$f":"IF(ISNA(VLOOKUP(A2,Data,O.6,FALSE)),\".................................................................................................................................................................................................................................\",IF(VLOOKUP(A2,Data,O.6,FALSE)=VALUE,\".................................................................................................................................................................................................................................\",VLOOKUP(A2,Data,O.6,FALSE)))","v":"Pembayaran piutang"}]
[]
[]
[]
[null,null,null,null,null,null,null,null,null,null,null,{"$f":"Kota&\", \"&IF(ISNA(VLOOKUP(A2,Data,O.1,FALSE)),\"..............................\",IF(VLOOKUP(A2,Data,O.1,FALSE)=VALUE,\"..............................\",TEXT(VLOOKUP(A2,Data,O.1,FALSE),\"dd mmmm yyy\")))","v":"Surabaya, 01 Januari 2019"}]
[null,null,null,null,null,null,null,null,null,null,null,"MATERAI"]
[null,null,null,null,"Jumlah Rp",null,{"$f":"IF(ISNA(VLOOKUP(A2,Data,O.4,FALSE)),\"....................\",IF(VLOOKUP(A2,Data,O.4,FALSE)=VALUE,\"....................\",VLOOKUP(A2,Data,O.4,FALSE)))","v":5000000}]
[]
[]
[null,null,null,null,{"$f":"Keterangan_1","v":"Pembayaran dianggap sah setelah masuk rekening kami :"}]
[null,null,null,null,{"$f":"Keterangan_2","v":"- BCA 00.0000.0000 a/n PT. Kembang Sepatu"},null,null,null,null,null,null,{"$f":"IF(ISNA(VLOOKUP(A2,Data,O.7,FALSE)),\".......................\",IF(VLOOKUP(A2,Data,O.7,FALSE)=VALUE,\".......................\",VLOOKUP(A2,Data,O.7,FALSE)))","v":"Muhammad"}]
[null,null,null,null,{"$f":"Keterangan_3","v":"- MANDIRI 00.0000.000 a/n PT. Kembang Sepatu"},null,null,null,null,null,null,{"$f":"IF(ISNA(VLOOKUP(A2,Data,O.8,FALSE)),\"..............................\",IF(VLOOKUP(A2,Data,O.8,FALSE)=VALUE,\"..............................\",VLOOKUP(A2,Data,O.8,FALSE)))","v":"Direktur"}]
[]
[]
[]
[]
[6]
[]
[null,null,null,null,null,{"$f":"Nama","v":"PT. KEMBANG SEPATU"}]
[null,null,null,null,null,{"$f":"Alamat","v":"Jl. Macan Kumbang No. 20, Perak, Surabaya"}]
[null,null,null,null,null,{"$f":"\"Telpon / Fax : \"&Telpon","v":"Telpon / Fax : (031) 700100"}]
[null,null,null,null,null,{"$f":"\"Email : \"&email","v":"Email : pt_kembang.s@yahoo.com"}]
[]
[]
[null,null,null,null,"K W I T A N S I"]
[null,null,null,null,{"$f":"\"Nomor : \"&IF(ISNA(VLOOKUP(A34,Data,O.3,FALSE)),\"...............\",IF(VLOOKUP(A34,Data,O.3,FALSE)=VALUE,\"...............\",VLOOKUP(A34,Data,O.3,FALSE)))","v":"Nomor : KWT-0006"}]
[]
[null,null,null,null,"Telah terima dari",null,null,":",{"$f":"IF(ISNA(VLOOKUP(A34,Data,O.2,FALSE)),\"...................................\",IF(VLOOKUP(A34,Data,O.2,FALSE)=VALUE,\"...................................\",VLOOKUP(A34,Data,O.2,FALSE)))","v":"Customer 006"}]
[]
[null,null,null,null,"Uang sejumlah",null,null,":",{"$f":"IF(G56=\"....................\",\".................................................................................................................................................................................................................................\",\"# \"&PROPER(Terb12&\" rupiah\")&\" #\")","v":"# Sepuluh Juta Rupiah #"}]
[]
[]
[null,null,null,null,"Untuk pembayaran",null,null,":",{"$f":"IF(ISNA(VLOOKUP(A34,Data,O.6,FALSE)),\".................................................................................................................................................................................................................................\",IF(VLOOKUP(A34,Data,O.6,FALSE)=VALUE,\".................................................................................................................................................................................................................................\",VLOOKUP(A34,Data,O.6,FALSE)))","v":"Pembayaran piutang"}]
[]
[]
[]
[null,null,null,null,null,null,null,null,null,null,null,{"$f":"Kota&\", \"&IF(ISNA(VLOOKUP(A34,Data,O.1,FALSE)),\"..............................\",IF(VLOOKUP(A34,Data,O.1,FALSE)=VALUE,\"..............................\",TEXT(VLOOKUP(A34,Data,O.1,FALSE),\"dd mmmm yyy\")))","v":"Surabaya, 17 Januari 2019"}]
[null,null,null,null,null,null,null,null,null,null,null,"MATERAI"]
[null,null,null,null,"Jumlah Rp",null,{"$f":"IF(ISNA(VLOOKUP(A34,Data,O.4,FALSE)),\"....................\",IF(VLOOKUP(A34,Data,O.4,FALSE)=VALUE,\"....................\",VLOOKUP(A34,Data,O.4,FALSE)))","v":10000000}]
[]
[]
[null,null,null,null,{"$f":"Keterangan_1","v":"Pembayaran dianggap sah setelah masuk rekening kami :"}]
[null,null,null,null,{"$f":"Keterangan_2","v":"- BCA 00.0000.0000 a/n PT. Kembang Sepatu"},null,null,null,null,null,null,{"$f":"IF(ISNA(VLOOKUP(A34,Data,O.7,FALSE)),\".......................\",IF(VLOOKUP(A34,Data,O.7,FALSE)=VALUE,\".......................\",VLOOKUP(A34,Data,O.7,FALSE)))","v":"Muhammad"}]
[null,null,null,null,{"$f":"Keterangan_3","v":"- MANDIRI 00.0000.000 a/n PT. Kembang Sepatu"},null,null,null,null,null,null,{"$f":"IF(ISNA(VLOOKUP(A34,Data,O.8,FALSE)),\"..............................\",IF(VLOOKUP(A34,Data,O.8,FALSE)=VALUE,\"..............................\",VLOOKUP(A34,Data,O.8,FALSE)))","v":"Direktur"}]
[]
[]
[]
[]
[2]
[]
[null,null,null,null,null,{"$f":"Nama","v":"PT. KEMBANG SEPATU"}]
[null,null,null,null,null,{"$f":"Alamat","v":"Jl. Macan Kumbang No. 20, Perak, Surabaya"}]
[null,null,null,null,null,{"$f":"\"Telpon / Fax : \"&Telpon","v":"Telpon / Fax : (031) 700100"}]
[null,null,null,null,null,{"$f":"\"Email : \"&email","v":"Email : pt_kembang.s@yahoo.com"}]
[]
[]
[null,null,null,null,"K W I T A N S I"]
[null,null,null,null,{"$f":"\"Nomor : \"&IF(ISNA(VLOOKUP(A66,Data,O.3,FALSE)),\"...............\",IF(VLOOKUP(A66,Data,O.3,FALSE)=VALUE,\"...............\",VLOOKUP(A66,Data,O.3,FALSE)))","v":"Nomor : KWT-0002"}]
[]
[null,null,null,null,"Telah terima dari",null,null,":",{"$f":"IF(ISNA(VLOOKUP(A66,Data,O.2,FALSE)),\"...................................\",IF(VLOOKUP(A66,Data,O.2,FALSE)=VALUE,\"...................................\",VLOOKUP(A66,Data,O.2,FALSE)))","v":"Customer 002"}]
[]
[null,null,null,null,"Uang sejumlah",null,null,":",{"$f":"IF(G88=\"....................\",\".................................................................................................................................................................................................................................\",\"# \"&PROPER(Terb13&\" rupiah\")&\" #\")","v":"# Tujuh Juta Lima Ratus Ribu Rupiah #"}]
[]
[]
[null,null,null,null,"Untuk pembayaran",null,null,":",{"$f":"IF(ISNA(VLOOKUP(A66,Data,O.6,FALSE)),\".................................................................................................................................................................................................................................\",IF(VLOOKUP(A66,Data,O.6,FALSE)=VALUE,\".................................................................................................................................................................................................................................\",VLOOKUP(A66,Data,O.6,FALSE)))","v":"Pembayaran piutang"}]
[]
[]
[]
[null,null,null,null,null,null,null,null,null,null,null,{"$f":"Kota&\", \"&IF(ISNA(VLOOKUP(A66,Data,O.1,FALSE)),\"..............................\",IF(VLOOKUP(A66,Data,O.1,FALSE)=VALUE,\"..............................\",TEXT(VLOOKUP(A66,Data,O.1,FALSE),\"dd mmmm yyy\")))","v":"Surabaya, 04 Januari 2019"}]
[null,null,null,null,null,null,null,null,null,null,null,"MATERAI"]
[null,null,null,null,"Jumlah Rp",null,{"$f":"IF(ISNA(VLOOKUP(A66,Data,O.4,FALSE)),\"....................\",IF(VLOOKUP(A66,Data,O.4,FALSE)=VALUE,\"....................\",VLOOKUP(A66,Data,O.4,FALSE)))","v":7500000}]
[]
[]
[null,null,null,null,{"$f":"Keterangan_1","v":"Pembayaran dianggap sah setelah masuk rekening kami :"}]
[null,null,null,null,{"$f":"Keterangan_2","v":"- BCA 00.0000.0000 a/n PT. Kembang Sepatu"},null,null,null,null,null,null,{"$f":"IF(ISNA(VLOOKUP(A66,Data,O.7,FALSE)),\".......................\",IF(VLOOKUP(A66,Data,O.7,FALSE)=VALUE,\".......................\",VLOOKUP(A66,Data,O.7,FALSE)))","v":"Ahmadi"}]
[null,null,null,null,{"$f":"Keterangan_3","v":"- MANDIRI 00.0000.000 a/n PT. Kembang Sepatu"},null,null,null,null,null,null,{"$f":"IF(ISNA(VLOOKUP(A66,Data,O.8,FALSE)),\"..............................\",IF(VLOOKUP(A66,Data,O.8,FALSE)=VALUE,\"..............................\",VLOOKUP(A66,Data,O.8,FALSE)))","v":"Manajer"}]
[]
[]
[]
[]
[4]
[]
[null,null,null,null,null,{"$f":"Nama","v":"PT. KEMBANG SEPATU"}]
[null,null,null,null,null,{"$f":"Alamat","v":"Jl. Macan Kumbang No. 20, Perak, Surabaya"}]
[null,null,null,null,null,{"$f":"\"Telpon / Fax : \"&Telpon","v":"Telpon / Fax : (031) 700100"}]
[null,null,null,null,null,{"$f":"\"Email : \"&email","v":"Email : pt_kembang.s@yahoo.com"}]
[]
[]
[null,null,null,null,"K W I T A N S I"]
[null,null,null,null,{"$f":"\"Nomor : \"&IF(ISNA(VLOOKUP(A98,Data,O.3,FALSE)),\"...............\",IF(VLOOKUP(A98,Data,O.3,FALSE)=VALUE,\"...............\",VLOOKUP(A98,Data,O.3,FALSE)))","v":"Nomor : KWT-0004"}]
[]
[null,null,null,null,"Telah terima dari",null,null,":",{"$f":"IF(ISNA(VLOOKUP(A98,Data,O.2,FALSE)),\"...................................\",IF(VLOOKUP(A98,Data,O.2,FALSE)=VALUE,\"...................................\",VLOOKUP(A98,Data,O.2,FALSE)))","v":"Customer 004"}]
[]
[null,null,null,null,"Uang sejumlah",null,null,":",{"$f":"IF(G120=\"....................\",\".................................................................................................................................................................................................................................\",\"# \"&PROPER(Terb14&\" rupiah\")&\" #\")","v":"# Enam Juta Rupiah #"}]
[]
[]
[null,null,null,null,"Untuk pembayaran",null,null,":",{"$f":"IF(ISNA(VLOOKUP(A98,Data,O.6,FALSE)),\".................................................................................................................................................................................................................................\",IF(VLOOKUP(A98,Data,O.6,FALSE)=VALUE,\".................................................................................................................................................................................................................................\",VLOOKUP(A98,Data,O.6,FALSE)))","v":"Pembayaran piutang"}]
[]
[]
[]
[null,null,null,null,null,null,null,null,null,null,null,{"$f":"Kota&\", \"&IF(ISNA(VLOOKUP(A98,Data,O.1,FALSE)),\"..............................\",IF(VLOOKUP(A98,Data,O.1,FALSE)=VALUE,\"..............................\",TEXT(VLOOKUP(A98,Data,O.1,FALSE),\"dd mmmm yyy\")))","v":"Surabaya, 09 Januari 2019"}]
[null,null,null,null,null,null,null,null,null,null,null,"MATERAI"]
[null,null,null,null,"Jumlah Rp",null,{"$f":"IF(ISNA(VLOOKUP(A98,Data,O.4,FALSE)),\"....................\",IF(VLOOKUP(A98,Data,O.4,FALSE)=VALUE,\"....................\",VLOOKUP(A98,Data,O.4,FALSE)))","v":6000000}]
[]
[]
[null,null,null,null,{"$f":"Keterangan_1","v":"Pembayaran dianggap sah setelah masuk rekening kami :"}]
[null,null,null,null,{"$f":"Keterangan_2","v":"- BCA 00.0000.0000 a/n PT. Kembang Sepatu"},null,null,null,null,null,null,{"$f":"IF(ISNA(VLOOKUP(A98,Data,O.7,FALSE)),\".......................\",IF(VLOOKUP(A98,Data,O.7,FALSE)=VALUE,\".......................\",VLOOKUP(A98,Data,O.7,FALSE)))","v":"Muhammad"}]
[null,null,null,null,{"$f":"Keterangan_3","v":"- MANDIRI 00.0000.000 a/n PT. Kembang Sepatu"},null,null,null,null,null,null,{"$f":"IF(ISNA(VLOOKUP(A98,Data,O.8,FALSE)),\"..............................\",IF(VLOOKUP(A98,Data,O.8,FALSE)=VALUE,\"..............................\",VLOOKUP(A98,Data,O.8,FALSE)))","v":"Direktur"}]
[]
[]
[]
[]
[4]
[]
[null,null,null,null,null,{"$f":"Nama","v":"PT. KEMBANG SEPATU"}]
[null,null,null,null,null,{"$f":"Alamat","v":"Jl. Macan Kumbang No. 20, Perak, Surabaya"}]
[null,null,null,null,null,{"$f":"\"Telpon / Fax : \"&Telpon","v":"Telpon / Fax : (031) 700100"}]
[null,null,null,null,null,{"$f":"\"Email : \"&email","v":"Email : pt_kembang.s@yahoo.com"}]
[]
[]
[null,null,null,null,"K W I T A N S I"]
[null,null,null,null,{"$f":"\"Nomor : \"&IF(ISNA(VLOOKUP(A130,Data,O.3,FALSE)),\"...............\",IF(VLOOKUP(A130,Data,O.3,FALSE)=VALUE,\"...............\",VLOOKUP(A130,Data,O.3,FALSE)))","v":"Nomor : KWT-0004"}]
[]
[null,null,null,null,"Telah terima dari",null,null,":",{"$f":"IF(ISNA(VLOOKUP(A130,Data,O.2,FALSE)),\"...................................\",IF(VLOOKUP(A130,Data,O.2,FALSE)=VALUE,\"...................................\",VLOOKUP(A130,Data,O.2,FALSE)))","v":"Customer 004"}]
[]
[null,null,null,null,"Uang sejumlah",null,null,":",{"$f":"IF(G152=\"....................\",\".................................................................................................................................................................................................................................\",\"# \"&PROPER(Terb15&\" rupiah\")&\" #\")","v":"# Enam Juta Rupiah #"}]
[]
[]
[null,null,null,null,"Untuk pembayaran",null,null,":",{"$f":"IF(ISNA(VLOOKUP(A130,Data,O.6,FALSE)),\".................................................................................................................................................................................................................................\",IF(VLOOKUP(A130,Data,O.6,FALSE)=VALUE,\".................................................................................................................................................................................................................................\",VLOOKUP(A130,Data,O.6,FALSE)))","v":"Pembayaran piutang"}]
[]
[]
[]
[null,null,null,null,null,null,null,null,null,null,null,{"$f":"Kota&\", \"&IF(ISNA(VLOOKUP(A130,Data,O.1,FALSE)),\"..............................\",IF(VLOOKUP(A130,Data,O.1,FALSE)=VALUE,\"..............................\",TEXT(VLOOKUP(A130,Data,O.1,FALSE),\"dd mmmm yyy\")))","v":"Surabaya, 09 Januari 2019"}]
[null,null,null,null,null,null,null,null,null,null,null,"MATERAI"]
[null,null,null,null,"Jumlah Rp",null,{"$f":"IF(ISNA(VLOOKUP(A130,Data,O.4,FALSE)),\"....................\",IF(VLOOKUP(A130,Data,O.4,FALSE)=VALUE,\"....................\",VLOOKUP(A130,Data,O.4,FALSE)))","v":6000000}]
[]
[]
[null,null,null,null,{"$f":"Keterangan_1","v":"Pembayaran dianggap sah setelah masuk rekening kami :"}]
[null,null,null,null,{"$f":"Keterangan_2","v":"- BCA 00.0000.0000 a/n PT. Kembang Sepatu"},null,null,null,null,null,null,{"$f":"IF(ISNA(VLOOKUP(A130,Data,O.7,FALSE)),\".......................\",IF(VLOOKUP(A130,Data,O.7,FALSE)=VALUE,\".......................\",VLOOKUP(A130,Data,O.7,FALSE)))","v":"Muhammad"}]
[null,null,null,null,{"$f":"Keterangan_3","v":"- MANDIRI 00.0000.000 a/n PT. Kembang Sepatu"},null,null,null,null,null,null,{"$f":"IF(ISNA(VLOOKUP(A130,Data,O.8,FALSE)),\"..............................\",IF(VLOOKUP(A130,Data,O.8,FALSE)=VALUE,\"..............................\",VLOOKUP(A130,Data,O.8,FALSE)))","v":"Direktur"}]
[]
[]
[]
[]
[5]
[]
[null,null,null,null,null,{"$f":"Nama","v":"PT. KEMBANG SEPATU"}]
[null,null,null,null,null,{"$f":"Alamat","v":"Jl. Macan Kumbang No. 20, Perak, Surabaya"}]
[null,null,null,null,null,{"$f":"\"Telpon / Fax : \"&Telpon","v":"Telpon / Fax : (031) 700100"}]
[null,null,null,null,null,{"$f":"\"Email : \"&email","v":"Email : pt_kembang.s@yahoo.com"}]
[]
[]
[null,null,null,null,"K W I T A N S I"]
[null,null,null,null,{"$f":"\"Nomor : \"&IF(ISNA(VLOOKUP(A162,Data,O.3,FALSE)),\"...............\",IF(VLOOKUP(A162,Data,O.3,FALSE)=VALUE,\"...............\",VLOOKUP(A162,Data,O.3,FALSE)))","v":"Nomor : KWT-0005"}]
[]
[null,null,null,null,"Telah terima dari",null,null,":",{"$f":"IF(ISNA(VLOOKUP(A162,Data,O.2,FALSE)),\"...................................\",IF(VLOOKUP(A162,Data,O.2,FALSE)=VALUE,\"...................................\",VLOOKUP(A162,Data,O.2,FALSE)))","v":"Customer 005"}]
[]
[null,null,null,null,"Uang sejumlah",null,null,":",{"$f":"IF(G184=\"....................\",\".................................................................................................................................................................................................................................\",\"# \"&PROPER(Terb16&\" rupiah\")&\" #\")","v":"# Delapan Juta Rupiah #"}]
[]
[]
[null,null,null,null,"Untuk pembayaran",null,null,":",{"$f":"IF(ISNA(VLOOKUP(A162,Data,O.6,FALSE)),\".................................................................................................................................................................................................................................\",IF(VLOOKUP(A162,Data,O.6,FALSE)=VALUE,\".................................................................................................................................................................................................................................\",VLOOKUP(A162,Data,O.6,FALSE)))","v":"Pembayaran piutang"}]
[]
[]
[]
[null,null,null,null,null,null,null,null,null,null,null,{"$f":"Kota&\", \"&IF(ISNA(VLOOKUP(A162,Data,O.1,FALSE)),\"..............................\",IF(VLOOKUP(A162,Data,O.1,FALSE)=VALUE,\"..............................\",TEXT(VLOOKUP(A162,Data,O.1,FALSE),\"dd mmmm yyy\")))","v":"Surabaya, 13 Januari 2019"}]
[null,null,null,null,null,null,null,null,null,null,null,"MATERAI"]
[null,null,null,null,"Jumlah Rp",null,{"$f":"IF(ISNA(VLOOKUP(A162,Data,O.4,FALSE)),\"....................\",IF(VLOOKUP(A162,Data,O.4,FALSE)=VALUE,\"....................\",VLOOKUP(A162,Data,O.4,FALSE)))","v":8000000}]
[]
[]
[null,null,null,null,{"$f":"Keterangan_1","v":"Pembayaran dianggap sah setelah masuk rekening kami :"}]
[null,null,null,null,{"$f":"Keterangan_2","v":"- BCA 00.0000.0000 a/n PT. Kembang Sepatu"},null,null,null,null,null,null,{"$f":"IF(ISNA(VLOOKUP(A162,Data,O.7,FALSE)),\".......................\",IF(VLOOKUP(A162,Data,O.7,FALSE)=VALUE,\".......................\",VLOOKUP(A162,Data,O.7,FALSE)))","v":"Muhammad"}]
[null,null,null,null,{"$f":"Keterangan_3","v":"- MANDIRI 00.0000.000 a/n PT. Kembang Sepatu"},null,null,null,null,null,null,{"$f":"IF(ISNA(VLOOKUP(A162,Data,O.8,FALSE)),\"..............................\",IF(VLOOKUP(A162,Data,O.8,FALSE)=VALUE,\"..............................\",VLOOKUP(A162,Data,O.8,FALSE)))","v":"Direktur"}]
[]
[]
[]
[]
[5]
[]
[null,null,null,null,null,{"$f":"Nama","v":"PT. KEMBANG SEPATU"}]
[null,null,null,null,null,{"$f":"Alamat","v":"Jl. Macan Kumbang No. 20, Perak, Surabaya"}]
[null,null,null,null,null,{"$f":"\"Telpon / Fax : \"&Telpon","v":"Telpon / Fax : (031) 700100"}]
[null,null,null,null,null,{"$f":"\"Email : \"&email","v":"Email : pt_kembang.s@yahoo.com"}]
[]
[]
[null,null,null,null,"K W I T A N S I"]
[null,null,null,null,{"$f":"\"Nomor : \"&IF(ISNA(VLOOKUP(A194,Data,O.3,FALSE)),\"...............\",IF(VLOOKUP(A194,Data,O.3,FALSE)=VALUE,\"...............\",VLOOKUP(A194,Data,O.3,FALSE)))","v":"Nomor : KWT-0005"}]
[]
[null,null,null,null,"Telah terima dari",null,null,":",{"$f":"IF(ISNA(VLOOKUP(A194,Data,O.2,FALSE)),\"...................................\",IF(VLOOKUP(A194,Data,O.2,FALSE)=VALUE,\"...................................\",VLOOKUP(A194,Data,O.2,FALSE)))","v":"Customer 005"}]
[]
[null,null,null,null,"Uang sejumlah",null,null,":",{"$f":"IF(G216=\"....................\",\".................................................................................................................................................................................................................................\",\"# \"&PROPER(Terb17&\" rupiah\")&\" #\")","v":"# Delapan Juta Rupiah #"}]
[]
[]
[null,null,null,null,"Untuk pembayaran",null,null,":",{"$f":"IF(ISNA(VLOOKUP(A194,Data,O.6,FALSE)),\".................................................................................................................................................................................................................................\",IF(VLOOKUP(A194,Data,O.6,FALSE)=VALUE,\".................................................................................................................................................................................................................................\",VLOOKUP(A194,Data,O.6,FALSE)))","v":"Pembayaran piutang"}]
[]
[]
[]
[null,null,null,null,null,null,null,null,null,null,null,{"$f":"Kota&\", \"&IF(ISNA(VLOOKUP(A194,Data,O.1,FALSE)),\"..............................\",IF(VLOOKUP(A194,Data,O.1,FALSE)=VALUE,\"..............................\",TEXT(VLOOKUP(A194,Data,O.1,FALSE),\"dd mmmm yyy\")))","v":"Surabaya, 13 Januari 2019"}]
[null,null,null,null,null,null,null,null,null,null,null,"MATERAI"]
[null,null,null,null,"Jumlah Rp",null,{"$f":"IF(ISNA(VLOOKUP(A194,Data,O.4,FALSE)),\"....................\",IF(VLOOKUP(A194,Data,O.4,FALSE)=VALUE,\"....................\",VLOOKUP(A194,Data,O.4,FALSE)))","v":8000000}]
[]
[]
[null,null,null,null,{"$f":"Keterangan_1","v":"Pembayaran dianggap sah setelah masuk rekening kami :"}]
[null,null,null,null,{"$f":"Keterangan_2","v":"- BCA 00.0000.0000 a/n PT. Kembang Sepatu"},null,null,null,null,null,null,{"$f":"IF(ISNA(VLOOKUP(A194,Data,O.7,FALSE)),\".......................\",IF(VLOOKUP(A194,Data,O.7,FALSE)=VALUE,\".......................\",VLOOKUP(A194,Data,O.7,FALSE)))","v":"Muhammad"}]
[null,null,null,null,{"$f":"Keterangan_3","v":"- MANDIRI 00.0000.000 a/n PT. Kembang Sepatu"},null,null,null,null,null,null,{"$f":"IF(ISNA(VLOOKUP(A194,Data,O.8,FALSE)),\"..............................\",IF(VLOOKUP(A194,Data,O.8,FALSE)=VALUE,\"..............................\",VLOOKUP(A194,Data,O.8,FALSE)))","v":"Direktur"}]
[]
[]
[]
[]
[2]
[]
[null,null,null,null,null,{"$f":"Nama","v":"PT. KEMBANG SEPATU"}]
[null,null,null,null,null,{"$f":"Alamat","v":"Jl. Macan Kumbang No. 20, Perak, Surabaya"}]
[null,null,null,null,null,{"$f":"\"Telpon / Fax : \"&Telpon","v":"Telpon / Fax : (031) 700100"}]
[null,null,null,null,null,{"$f":"\"Email : \"&email","v":"Email : pt_kembang.s@yahoo.com"}]
[]
[]
[null,null,null,null,"K W I T A N S I"]
[null,null,null,null,{"$f":"\"Nomor : \"&IF(ISNA(VLOOKUP(A226,Data,O.3,FALSE)),\"...............\",IF(VLOOKUP(A226,Data,O.3,FALSE)=VALUE,\"...............\",VLOOKUP(A226,Data,O.3,FALSE)))","v":"Nomor : KWT-0002"}]
[]
[null,null,null,null,"Telah terima dari",null,null,":",{"$f":"IF(ISNA(VLOOKUP(A226,Data,O.2,FALSE)),\"...................................\",IF(VLOOKUP(A226,Data,O.2,FALSE)=VALUE,\"...................................\",VLOOKUP(A226,Data,O.2,FALSE)))","v":"Customer 002"}]
[]
[null,null,null,null,"Uang sejumlah",null,null,":",{"$f":"IF(G248=\"....................\",\".................................................................................................................................................................................................................................\",\"# \"&PROPER(Terb18&\" rupiah\")&\" #\")","v":"# Tujuh Juta Lima Ratus Ribu Rupiah #"}]
[]
[]
[null,null,null,null,"Untuk pembayaran",null,null,":",{"$f":"IF(ISNA(VLOOKUP(A226,Data,O.6,FALSE)),\".................................................................................................................................................................................................................................\",IF(VLOOKUP(A226,Data,O.6,FALSE)=VALUE,\".................................................................................................................................................................................................................................\",VLOOKUP(A226,Data,O.6,FALSE)))","v":"Pembayaran piutang"}]
[]
[]
[]
[null,null,null,null,null,null,null,null,null,null,null,{"$f":"Kota&\", \"&IF(ISNA(VLOOKUP(A226,Data,O.1,FALSE)),\"..............................\",IF(VLOOKUP(A226,Data,O.1,FALSE)=VALUE,\"..............................\",TEXT(VLOOKUP(A226,Data,O.1,FALSE),\"dd mmmm yyy\")))","v":"Surabaya, 04 Januari 2019"}]
[null,null,null,null,null,null,null,null,null,null,null,"MATERAI"]
[null,null,null,null,"Jumlah Rp",null,{"$f":"IF(ISNA(VLOOKUP(A226,Data,O.4,FALSE)),\"....................\",IF(VLOOKUP(A226,Data,O.4,FALSE)=VALUE,\"....................\",VLOOKUP(A226,Data,O.4,FALSE)))","v":7500000}]
[]
[]
[null,null,null,null,{"$f":"Keterangan_1","v":"Pembayaran dianggap sah setelah masuk rekening kami :"}]
[null,null,null,null,{"$f":"Keterangan_2","v":"- BCA 00.0000.0000 a/n PT. Kembang Sepatu"},null,null,null,null,null,null,{"$f":"IF(ISNA(VLOOKUP(A226,Data,O.7,FALSE)),\".......................\",IF(VLOOKUP(A226,Data,O.7,FALSE)=VALUE,\".......................\",VLOOKUP(A226,Data,O.7,FALSE)))","v":"Ahmadi"}]
[null,null,null,null,{"$f":"Keterangan_3","v":"- MANDIRI 00.0000.000 a/n PT. Kembang Sepatu"},null,null,null,null,null,null,{"$f":"IF(ISNA(VLOOKUP(A226,Data,O.8,FALSE)),\"..............................\",IF(VLOOKUP(A226,Data,O.8,FALSE)=VALUE,\"..............................\",VLOOKUP(A226,Data,O.8,FALSE)))","v":"Manajer"}]
[]
[]
[]
[]
[2]
[]
[null,null,null,null,null,{"$f":"Nama","v":"PT. KEMBANG SEPATU"}]
[null,null,null,null,null,{"$f":"Alamat","v":"Jl. Macan Kumbang No. 20, Perak, Surabaya"}]
[null,null,null,null,null,{"$f":"\"Telpon / Fax : \"&Telpon","v":"Telpon / Fax : (031) 700100"}]
[null,null,null,null,null,{"$f":"\"Email : \"&email","v":"Email : pt_kembang.s@yahoo.com"}]
[]
[]
[null,null,null,null,"K W I T A N S I"]
[null,null,null,null,{"$f":"\"Nomor : \"&IF(ISNA(VLOOKUP(A258,Data,O.3,FALSE)),\"...............\",IF(VLOOKUP(A258,Data,O.3,FALSE)=VALUE,\"...............\",VLOOKUP(A258,Data,O.3,FALSE)))","v":"Nomor : KWT-0002"}]
[]
[null,null,null,null,"Telah terima dari",null,null,":",{"$f":"IF(ISNA(VLOOKUP(A258,Data,O.2,FALSE)),\"...................................\",IF(VLOOKUP(A258,Data,O.2,FALSE)=VALUE,\"...................................\",VLOOKUP(A258,Data,O.2,FALSE)))","v":"Customer 002"}]
[]
[null,null,null,null,"Uang sejumlah",null,null,":",{"$f":"IF(G280=\"....................\",\".................................................................................................................................................................................................................................\",\"# \"&PROPER(Terb19&\" rupiah\")&\" #\")","v":"# Tujuh Juta Lima Ratus Ribu Rupiah #"}]
[]
[]
[null,null,null,null,"Untuk pembayaran",null,null,":",{"$f":"IF(ISNA(VLOOKUP(A258,Data,O.6,FALSE)),\".................................................................................................................................................................................................................................\",IF(VLOOKUP(A258,Data,O.6,FALSE)=VALUE,\".................................................................................................................................................................................................................................\",VLOOKUP(A258,Data,O.6,FALSE)))","v":"Pembayaran piutang"}]
[]
[]
[]
[null,null,null,null,null,null,null,null,null,null,null,{"$f":"Kota&\", \"&IF(ISNA(VLOOKUP(A258,Data,O.1,FALSE)),\"..............................\",IF(VLOOKUP(A258,Data,O.1,FALSE)=VALUE,\"..............................\",TEXT(VLOOKUP(A258,Data,O.1,FALSE),\"dd mmmm yyy\")))","v":"Surabaya, 04 Januari 2019"}]
[null,null,null,null,null,null,null,null,null,null,null,"MATERAI"]
[null,null,null,null,"Jumlah Rp",null,{"$f":"IF(ISNA(VLOOKUP(A258,Data,O.4,FALSE)),\"....................\",IF(VLOOKUP(A258,Data,O.4,FALSE)=VALUE,\"....................\",VLOOKUP(A258,Data,O.4,FALSE)))","v":7500000}]
[]
[]
[null,null,null,null,{"$f":"Keterangan_1","v":"Pembayaran dianggap sah setelah masuk rekening kami :"}]
[null,null,null,null,{"$f":"Keterangan_2","v":"- BCA 00.0000.0000 a/n PT. Kembang Sepatu"},null,null,null,null,null,null,{"$f":"IF(ISNA(VLOOKUP(A258,Data,O.7,FALSE)),\".......................\",IF(VLOOKUP(A258,Data,O.7,FALSE)=VALUE,\".......................\",VLOOKUP(A258,Data,O.7,FALSE)))","v":"Ahmadi"}]
[null,null,null,null,{"$f":"Keterangan_3","v":"- MANDIRI 00.0000.000 a/n PT. Kembang Sepatu"},null,null,null,null,null,null,{"$f":"IF(ISNA(VLOOKUP(A258,Data,O.8,FALSE)),\"..............................\",IF(VLOOKUP(A258,Data,O.8,FALSE)=VALUE,\"..............................\",VLOOKUP(A258,Data,O.8,FALSE)))","v":"Manajer"}]
[]
[]
[]
[]
[2]
[]
[null,null,null,null,null,{"$f":"Nama","v":"PT. KEMBANG SEPATU"}]
[null,null,null,null,null,{"$f":"Alamat","v":"Jl. Macan Kumbang No. 20, Perak, Surabaya"}]
[null,null,null,null,null,{"$f":"\"Telpon / Fax : \"&Telpon","v":"Telpon / Fax : (031) 700100"}]
[null,null,null,null,null,{"$f":"\"Email : \"&email","v":"Email : pt_kembang.s@yahoo.com"}]
[]
[]
[null,null,null,null,"K W I T A N S I"]
[null,null,null,null,{"$f":"\"Nomor : \"&IF(ISNA(VLOOKUP(A290,Data,O.3,FALSE)),\"...............\",IF(VLOOKUP(A290,Data,O.3,FALSE)=VALUE,\"...............\",VLOOKUP(A290,Data,O.3,FALSE)))","v":"Nomor : KWT-0002"}]
[]
[null,null,null,null,"Telah terima dari",null,null,":",{"$f":"IF(ISNA(VLOOKUP(A290,Data,O.2,FALSE)),\"...................................\",IF(VLOOKUP(A290,Data,O.2,FALSE)=VALUE,\"...................................\",VLOOKUP(A290,Data,O.2,FALSE)))","v":"Customer 002"}]
[]
[null,null,null,null,"Uang sejumlah",null,null,":",{"$f":"IF(G312=\"....................\",\".................................................................................................................................................................................................................................\",\"# \"&PROPER(Terb20&\" rupiah\")&\" #\")","v":"# Tujuh Juta Lima Ratus Ribu Rupiah #"}]
[]
[]
[null,null,null,null,"Untuk pembayaran",null,null,":",{"$f":"IF(ISNA(VLOOKUP(A290,Data,O.6,FALSE)),\".................................................................................................................................................................................................................................\",IF(VLOOKUP(A290,Data,O.6,FALSE)=VALUE,\".................................................................................................................................................................................................................................\",VLOOKUP(A290,Data,O.6,FALSE)))","v":"Pembayaran piutang"}]
[]
[]
[]
[null,null,null,null,null,null,null,null,null,null,null,{"$f":"Kota&\", \"&IF(ISNA(VLOOKUP(A290,Data,O.1,FALSE)),\"..............................\",IF(VLOOKUP(A290,Data,O.1,FALSE)=VALUE,\"..............................\",TEXT(VLOOKUP(A290,Data,O.1,FALSE),\"dd mmmm yyy\")))","v":"Surabaya, 04 Januari 2019"}]
[null,null,null,null,null,null,null,null,null,null,null,"MATERAI"]
[null,null,null,null,"Jumlah Rp",null,{"$f":"IF(ISNA(VLOOKUP(A290,Data,O.4,FALSE)),\"....................\",IF(VLOOKUP(A290,Data,O.4,FALSE)=VALUE,\"....................\",VLOOKUP(A290,Data,O.4,FALSE)))","v":7500000}]
[]
[]
[null,null,null,null,{"$f":"Keterangan_1","v":"Pembayaran dianggap sah setelah masuk rekening kami :"}]
[null,null,null,null,{"$f":"Keterangan_2","v":"- BCA 00.0000.0000 a/n PT. Kembang Sepatu"},null,null,null,null,null,null,{"$f":"IF(ISNA(VLOOKUP(A290,Data,O.7,FALSE)),\".......................\",IF(VLOOKUP(A290,Data,O.7,FALSE)=VALUE,\".......................\",VLOOKUP(A290,Data,O.7,FALSE)))","v":"Ahmadi"}]
[null,null,null,null,{"$f":"Keterangan_3","v":"- MANDIRI 00.0000.000 a/n PT. Kembang Sepatu"},null,null,null,null,null,null,{"$f":"IF(ISNA(VLOOKUP(A290,Data,O.8,FALSE)),\"..............................\",IF(VLOOKUP(A290,Data,O.8,FALSE)=VALUE,\"..............................\",VLOOKUP(A290,Data,O.8,FALSE)))","v":"Manajer"}]

{"sheet":"HD","index":5,"n_rows":6000,"n_cols":650,"rows_kept":6000,"cut":false,"hidden":true,"merged":[]}
[]
[null,"info"]
[]
[]
[]
[]
[]
[]
[]
[]
[]
[]
[]
[]
[]
[]
[]
[]
[]
[]
[]
[]
[]
[]
[]
[]
[]
[]
[]
[]
[]
[]
[]
[]
[]
[]
[]
[]
[]
[]
[]
[]
[]
[]
[]
[]
[]
[]
[]
[]
[]
[]
[]
[]
[]
[]
[]
[]
[]
[]
[]
[]
[]
[]
[]
[]
[]
[]
[]
[]
[]
[]
[]
[]
[]
[]
[]
[]
[]
[]
[]
[]
[]
[]
[]
[]
[]
[]
[]
[]
[]
[]
[]
[]
[]
[]
[]
[]
[]
[]
[]
[]
[]
[]
[]
[]
[]
[]
[]
[]
[]
[]
[]
[]
[]
[]
[]
[]
[]
[]
[]
[]
[]
[]
[]
[]
[]
[]
[]
[]
[]
[]
[]
[]
[]
[]
[]
[]
[]
[]
[]
[]
[]
[]
[]
[]
[]
[]
[]
[]
[]
[]
[]
[]
[]
[]
[]
[]
[]
[]
[]
[]
[]
[]
[]
[]
[]
[]
[]
[]
[]
[]
[]
[]
[]
[]
[]
[]
[]
[]
[]
[]
[]
[]
[]
[]
[]
[]
[]
[]
[]
[]
[]
[]
[]
[]
[]
[]
[]
[]
[]
[]
[]
[]
[]
[]
[]
[]
[]
[]
[]
[]
[]
[]
[]
[]
[]
[]
[]
[]
[]
[]
[]
[]
[]
[]
[]
[]
[]
[]
[]
[]
[]
[]
[]
[]
[]
[]
[]
[]
[]
[]
[]
[]
[]
[]
[]
[]
[]
[]
[]
[]
[]
[]
[]
[]
[]
[]
[]
[]
[]
[]
[]
[]
[]
[]
[]
[]
[]
[]
[]
[]
[]
[]
[]
[]
[]
[]
[]
[]
[]
[]
[]
[]
[]
[]
[]
[]
[]
[]
[]
[]
[]
[]
[]
[]
[]
[]
[]
[]
[]
[]
[]
[]
[]
[]
[]
[]
[]
[]
[]
[]
[]
[]
[]
[]
[]
[]
[]
[]
[]
[]
[]
[]
[]
[]
[]
[]
[]
[]
[]
[]
[]
[]
[]
[]
[]
[]
[]
[]
[]
[]
[]
[]
[]
[]
[]
[]
[]
[]
[]
[]
[]
[]
[]
[]
[]
[]
[]
[]
[]
[]
[]
[]
[]
[]
[]
[]
[]
[]
[]
[]
[]
[]
[]
[]
[]
[]
[]
[]
[]
[]
[]
[]
[]
[]
[]
[]
[]
[]
[]
[]
[]
[]
[]
[]
[]
[]
[]
[]
[]
[]
[]
[]
[]
[]
[]
[]
[]
[]
[]
[]
[]
[]
[]
[]
[]
[]
[]
[]
[]
[]
[]
[]
[]
[]
[]
[]
[]
[]
[]
[]
[]
[]
[]
[]
[]
[]
[]
[]
[]
[]
[]
[]
[]
[]
[]
[]
[]
[]
[]
[]
[]
[]
[]
[]
[]
[]
[]
[]
[]
[]
[]
[]
[]
[]
[]
[]
[]
[]
[]
[]
[]
[]
[]
[]
[]
[]
[]
[]
[]
[]
[]
[]
[]
[]
[]
[]
[]
[]
[]
[]
[]
[]
[]
[]
[]
[]
[]
[]
[]
[]
[]
[]
[]
[]
[]
[]
[]
[]
[]
[]
[]
[]
[]
[]
[]
[]
[]
[]
[]
[]
[]
[]
[]
[]
[]
[]
[]
[]
[]
[]
[]
[]
[]
[]
[]
[]
[]
[]
[]
[]
[]
[]
[]
[]
[]
[]
[]
[]
[]
[]
[]
[]
[]
[]
[]
[]
[]
[]
[]
[]
[]
[]
[]
[]
[]
[]
[]
[]
[]
[]
[]
[]
[]
[]
[]
[]
[]
[]
[]
[]
[]
[]
[]
[]
[]
[]
[]
[]
[]
[]
[]
[]
[]
[]
[]
[]
[]
[]
[]
[]
[]
[]
[]
[]
[]
[]
[]
[]
[]
[]
[]
[]
[]
[]
[]
[]
[]
[]
[]
[]
[]
[]
[]
[]
[]
[]
[]
[]
[]
[]
[]
[]
[]
[]
[]
[]
[]
[]
[]
[]
[]
[]
[]
[]
[]
[]
[]
[]
[]
[]
[]
[]
[]
[]
[]
[]
[]
[]
[]
[]
[]
[]
[]
[]
[]
[]
[]
[]
[]
[]
[]
[]
[]
[]
[]
[]
[]
[]
[]
[]
[]
[]
[]
[]
[]
[]
[]
[]
[]
[]
[]
[]
[]
[]
[]
[]
[]
[]
[]
[]
[]
[]
[]
[]
[]
[]
[]
[]
[]
[]
[]
[]
[]
[]
[]
[]
[]
[]
[]
[]
[]
[]
[]
[]
[]
[]
[]
[]
[]
[]
[]
[]
[]
[]
[]
[]
[]
[]
[]
[]
[]
[]
[]
[]
[]
[]
[]
[]
[]
[]
[]
[]
[]
[]
[]
[]
[]
[]
[]
[]
[]
[]
[]
[]
[]
[]
[]
[]
[]
[]
[]
[]
[]
[]
[]
[]
[]
[]
[]
[]
[]
[]
[]
[]
[]
[]
[]
[]
[]
[]
[]
[]
[]
[]
[]
[]
[]
[]
[]
[]
[]
[]
[]
[]
[]
[]
[]
[]
[]
[]
[]
[]
[]
[]
[]
[]
[]
[]
[]
[]
[]
[]
[]
[]
[]
[]
[]
[]
[]
[]
[]
[]
[]
[]
[]
[]
[]
[]
[]
[]
[]
[]
[]
[]
[]
[]
[]
[]
[]
[]
[]
[]
[]
[]
[]
[]
[]
[]
[]
[]
[]
[]
[]
[]
[]
[]
[]
[]
[]
[]
[]
[]
[]
[]
[]
[]
[]
[]
[]
[]
[]
[]
[]
[]
[]
[]
[]
[]
[]
[]
[]
[]
[]
[]
[]
[]
[]
[]
[]
[]
[]
[]
[]
[]
[]
[]
[]
[]
[]
[]
[]
[]
[]
[]
[]
[]
[]
[]
[]
[]
[]
[]
[]
[]
[]
[]
[]
[]
[]
[]
[]
[]
[]
[]
[]
[]
[]
[]
[]
[]
[]
[]
[]
[]
[]
[]
[]
[]
[]
[]
[]
[]
[]
[]
[]
[]
[]
[]
[]
[]
[]
[]
[]
[]
[]
[]
[]
[]
[]
[]
[]
[]
[]
[]
[]
[]
[]
[]
[]
[]
[]
[]
[]
[]
[]
[]
[]
[]
[]
[]
[]
[]
[]
[]
[]
[]
[]
[null,{"$f":"LEFT(RIGHT(Info!A18,12),8)","v":"xclmedia"},null,null,null,null,null,null,null,null,null,null,null,null,null,null,null,null,null,null,null,null,null,null,null,null,null,null,null,null,null,null,null,null,null,null,null,null,null,null,null,null,null,null,null,null,null,null,null,null,null,null,null,null,null,null,null,null,null,null,null,null,null,null,null,null,null,null,null,null,null,null,null,null,null,null,null,null,null,null,null,null,null,null,null,null,null,null,null,null,null,null,null,null,null,null,null,null,null,null,null,null,null,null,null,null,null,null,null,null,null,null,null,null,null,null,null,null,null,null,null,null,null,null,null,null,null,null,null,null,null,null,null,null,null,null,null,null,null,null,null,null,null,null,null,null,null,null,null,null,null,null,null,null,null,null,null,null,null,null,null,null,null,null,null,null,null,null,null,null,null,null,null,null,null,null,null,null,null,null,null,null,null,null,null,null,null,null,null,null,null,null,null,null,null,null,null,null,null,null,null,null,null,null,null,null,null,null,null,null,null,null,null,null,null,null,null,null,null,null,null,null,null,null,null,null,null,null,null,null,null,null,null,null,null,null,null,null,null,null,null,null,null,null,null,null,null,null,null,null,null,null,null,null,null,null,null,null,null,null,null,null,null,null,null,null,null,null,null,null,null,null,null,null,null,null,null,null,null,null,null,null,null,null,null,null,null,null,null,null,null,null,null,null,null,null,null,null,null,null,null,null,null,null,null,null,null,null,null,null,null,null,null,null,null,null,null,null,null,null,null,null,null,null,null,null,null,null,null,null,null,null,null,null,null,null,null,null,null,null,null,null,null,null,null,null,null,null,null,null,null,null,null,null,null,null,null,null,null,null,null,null,null,null,null,null,null,null,null,null,null,null,null,null,null,null,null,null,null,null,null,null,null,null,null,null,null,null,null,null,null,null,null,null,null,null,null,null,null,null,null,null,null,null,null,null,null,null,null,null,null,null,null,null,null,null,null,null,null,null,null,null,null,null,null,null,null,null,null,null,null,null,null,null,null,null,null,null,null,null,null,null,null,null,null,null,null,null,null,null,null,null,null,null,null,null,null,null,null,null,null,null,null,null,null,null,null,null,null,null,null,null,null,null,null,null,null,null,null,null,null,null,null,null,null,null,null,null,null,null,null,null,null,null,null,null,null,null,null,null,null,null,null,null,null,null,null,null,null,null,null,null,null,null,null,null,null,null,null,null,null,null,null,null,null,null,null,null,null,null,null,null,null,null,null,null,null,null,null,null,null,null,null,null,null,null,null,null,null,null,null,null,null,null,null,null,null,null,null,null,null,null,null,null,null,null,null,null,null,null,null,null,null,null,null,null,null,null,null,null,null,null,null,null,null,null,null,null,null,null,null,null,null,null,null,null,null,null,null,null,null,null,null,null,null,null,null,null,null,null,null,null,null,null,null,null,null,null,null,null,null,null,null,null,null,null,null,null,null,null,null,null,null,null,null,null,null,null,null,null,null,null,null,null,null,null,null,null,"o@xcl"]
[]
[]
[]
[]
[]
[]
[]
[]
[]
[]
[]
[]
[]
[]
[]
[]
[]
[]
[]
[]
[]
[]
[]
[]
[]
[]
[]
[]
[]
[]
[]
[]
[]
[]
[]
[]
[]
[]
[]
[]
[]
[]
[]
[]
[]
[]
[]
[]
[]
[]
[]
[]
[]
[]
[]
[]
[]
[]
[]
[]
[]
[]
[]
[]
[]
[]
[]
[]
[]
[]
[]
[]
[]
[]
[]
[]
[]
[]
[]
[]
[]
[]
[]
[]
[]
[]
[]
[]
[]
[]
[]
[]
[]
[]
[]
[]
[]
[]
[]
[]
[]
[]
[]
[]
[]
[]
[]
[]
[]
[]
[]
[]
[]
[]
[]
[]
[]
[]
[]
[]
[]
[]
[]
[]
[]
[]
[]
[]
[]
[]
[]
[]
[]
[]
[]
[]
[]
[]
[]
[]
[]
[]
[]
[]
[]
[]
[]
[]
[]
[]
[]
[]
[]
[]
[]
[]
[]
[]
[]
[]
[]
[]
[]
[]
[]
[]
[]
[]
[]
[]
[]
[]
[]
[]
[]
[]
[]
[]
[]
[]
[]
[]
[]
[]
[]
[]
[]
[]
[]
[]
[]
[]
[]
[]
[]
[]
[]
[]
[]
[]
[]
[]
[]
[]
[]
[]
[]
[]
[]
[]
[]
[]
[]
[]
[]
[]
[]
[]
[]
[]
[]
[]
[]
[]
[]
[]
[]
[]
[]
[]
[]
[]
[]
[]
[]
[]
[]
[]
[]
[]
[]
[]
[]
[]
[]
[]
[]
[]
[]
[]
[]
[]
[]
[]
[]
[]
[]
[]
[]
[]
[]
[]
[]
[]
[]
[]
[]
[]
[]
[]
[]
[]
[]
[]
[]
[]
[]
[]
[]
[]
[]
[]
[]
[]
[]
[]
[]
[]
[]
[]
[]
[]
[]
[]
[]
[]
[]
[]
[]
[]
[]
[]
[]
[]
[]
[]
[]
[]
[]
[]
[]
[]
[]
[]
[]
[]
[]
[]
[]
[]
[]
[]
[]
[]
[]
[]
[]
[]
[]
[]
[]
[]
[]
[]
[]
[]
[]
[]
[]
[]
[]
[]
[]
[]
[]
[]
[]
[]
[]
[]
[]
[]
[]
[]
[]
[]
[]
[]
[]
[]
[]
[]
[]
[]
[]
[]
[]
[]
[]
[]
[]
[]
[]
[]
[]
[]
[]
[]
[]
[]
[]
[]
[]
[]
[]
[]
[]
[]
[]
[]
[]
[]
[]
[]
[]
[]
[]
[]
[]
[]
[]
[]
[]
[]
[]
[]
[]
[]
[]
[]
[]
[]
[]
[]
[]
[]
[]
[]
[]
[]
[]
[]
[]
[]
[]
[]
[]
[]
[]
[]
[]
[]
[]
[]
[]
[]
[]
[]
[]
[]
[]
[]
[]
[]
[]
[]
[]
[]
[]
[]
[]
[]
[]
[]
[]
[]
[]
[]
[]
[]
[]
[]
[]
[]
[]
[]
[]
[]
[]
[]
[]
[]
[]
[]
[]
[]
[]
[]
[]
[]
[]
[]
[]
[]
[]
[]
[]
[]
[]
[]
[]
[]
[]
[]
[]
[]
[]
[]
[]
[]
[]
[]
[]
[]
[]
[]
[]
[]
[]
[]
[]
[]
[]
[]
[]
[]
[]
[]
[]
[]
[]
[]
[]
[]
[]
[]
[]
[]
[]
[]
[]
[]
[]
[]
[]
[]
[]
[]
[]
[]
[]
[]
[]
[]
[]
[]
[]
[]
[]
[]
[]
[]
[]
[]
[]
[]
[]
[]
[]
[]
[]
[]
[]
[]
[]
[]
[]
[]
[]
[]
[]
[]
[]
[]
[]
[]
[]
[]
[]
[]
[]
[]
[]
[]
[]
[]
[]
[]
[]
[]
[]
[]
[]
[]
[]
[]
[]
[]
[]
[]
[]
[]
[]
[]
[]
[]
[]
[]
[]
[]
[]
[]
[]
[]
[]
[]
[]
[]
[]
[]
[]
[]
[]
[]
[]
[]
[]
[]
[]
[]
[]
[]
[]
[]
[]
[]
[]
[]
[]
[]
[]
[]
[]
[]
[]
[]
[]
[]
[]
[]
[]
[]
[]
[]
[]
[]
[]
[]
[]
[]
[]
[]
[]
[]
[]
[]
[]
[]
[]
[]
[]
[]
[]
[]
[]
[]
[]
[]
[]
[]
[]
[]
[]
[]
[]
[]
[]
[]
[]
[]
[]
[]
[]
[]
[]
[]
[]
[]
[]
[]
[]
[]
[]
[]
[]
[]
[]
[]
[]
[]
[]
[]
[]
[]
[]
[]
[]
[]
[]
[]
[]
[]
[]
[]
[]
[]
[]
[]
[]
[]
[]
[]
[]
[]
[]
[]
[]
[]
[]
[]
[]
[]
[]
[]
[]
[]
[]
[]
[]
[]
[]
[]
[]
[]
[]
[]
[]
[]
[]
[]
[]
[]
[]
[]
[]
[]
[]
[]
[]
[]
[]
[]
[]
[]
[]
[]
[]
[]
[]
[]
[]
[]
[]
[]
[]
[]
[]
[]
[]
[]
[]
[]
[]
[]
[]
[]
[]
[]
[]
[]
[]
[]
[]
[]
[]
[]
[]
[]
[]
[]
[]
[]
[]
[]
[]
[]
[]
[]
[]
[]
[]
[]
[]
[]
[]
[]
[]
[]
[]
[]
[]
[]
[]
[]
[]
[]
[]
[]
[]
[]
[]
[]
[]
[]
[]
[]
[]
[]
[]
[]
[]
[]
[]
[]
[]
[]
[]
[]
[]
[]
[]
[]
[]
[]
[]
[]
[]
[]
[]
[]
[]
[]
[]
[]
[]
[]
[]
[]
[]
[]
[]
[]
[]
[]
[]
[]
[]
[]
[]
[]
[]
[]
[]
[]
[]
[]
[]
[]
[]
[]
[]
[]
[]
[]
[]
[]
[]
[]
[]
[]
[]
[]
[]
[]
[]
[]
[]
[]
[]
[]
[]
[]
[]
[]
[]
[]
[]
[]
[]
[]
[]
[]
[]
[]
[]
[]
[]
[]
[]
[]
[]
[]
[]
[]
[]
[]
[]
[]
[]
[]
[]
[]
[]
[]
[]
[]
[]
[]
[]
[]
[]
[]
[]
[]
[]
[]
[]
[]
[]
[]
[]
[]
[]
[]
[]
[]
[]
[]
[]
[]
[]
[]
[]
[]
[]
[]
[]
[]
[]
[]
[]
[]
[]
[]
[]
[]
[]
[]
[]
[null,{"$f":"IF(AND(COUNTBLANK(Info!A24:X24)=24,COUNTBLANK(Info!X1:X24)=24,RIGHT(Data!I1,8)=B1000,LEFT(RIGHT(REG,LEN(REG)-3),5)=XY1000,LEFT(Info!D16,4)=B2,REG=XY5000),XY6000,\"#\")","v":0}]
[]
[]
[]
[]
[]
[]
[]
[]
[]
[]
[]
[]
[]
[]
[]
[]
[]
[]
[]
[]
[]
[]
[]
[]
[]
[]
[]
[]
[]
[]
[]
[]
[]
[]
[]
[]
[]
[]
[]
[]
[]
[]
[]
[]
[]
[]
[]
[]
[]
[]
[]
[]
[]
[]
[]
[]
[]
[]
[]
[]
[]
[]
[]
[]
[]
[]
[]
[]
[]
[]
[]
[]
[]
[]
[]
[]
[]
[]
[]
[]
[]
[]
[]
[]
[]
[]
[]
[]
[]
[]
[]
[]
[]
[]
[]
[]
[]
[]
[]
[]
[]
[]
[]
[]
[]
[]
[]
[]
[]
[]
[]
[]
[]
[]
[]
[]
[]
[]
[]
[]
[]
[]
[]
[]
[]
[]
[]
[]
[]
[]
[]
[]
[]
[]
[]
[]
[]
[]
[]
[]
[]
[]
[]
[]
[]
[]
[]
[]
[]
[]
[]
[]
[]
[]
[]
[]
[]
[]
[]
[]
[]
[]
[]
[]
[]
[]
[]
[]
[]
[]
[]
[]
[]
[]
[]
[]
[]
[]
[]
[]
[]
[]
[]
[]
[]
[]
[]
[]
[]
[]
[]
[]
[]
[]
[]
[]
[]
[]
[]
[]
[]
[]
[]
[]
[]
[]
[]
[]
[]
[]
[]
[]
[]
[]
[]
[]
[]
[]
[]
[]
[]
[]
[]
[]
[]
[]
[]
[]
[]
[]
[]
[]
[]
[]
[]
[]
[]
[]
[]
[]
[]
[]
[]
[]
[]
[]
[]
[]
[]
[]
[]
[]
[]
[]
[]
[]
[]
[]
[]
[]
[]
[]
[]
[]
[]
[]
[]
[]
[]
[]
[]
[]
[]
[]
[]
[]
[]
[]
[]
[]
[]
[]
[]
[]
[]
[]
[]
[]
[]
[]
[]
[]
[]
[]
[]
[]
[]
[]
[]
[]
[]
[]
[]
[]
[]
[]
[]
[]
[]
[]
[]
[]
[]
[]
[]
[]
[]
[]
[]
[]
[]
[]
[]
[]
[]
[]
[]
[]
[]
[]
[]
[]
[]
[]
[]
[]
[]
[]
[]
[]
[]
[]
[]
[]
[]
[]
[]
[]
[]
[]
[]
[]
[]
[]
[]
[]
[]
[]
[]
[]
[]
[]
[]
[]
[]
[]
[]
[]
[]
[]
[]
[]
[]
[]
[]
[]
[]
[]
[]
[]
[]
[]
[]
[]
[]
[]
[]
[]
[]
[]
[]
[]
[]
[]
[]
[]
[]
[]
[]
[]
[]
[]
[]
[]
[]
[]
[]
[]
[]
[]
[]
[]
[]
[]
[]
[]
[]
[]
[]
[]
[]
[]
[]
[]
[]
[]
[]
[]
[]
[]
[]
[]
[]
[]
[]
[]
[]
[]
[]
[]
[]
[]
[]
[]
[]
[]
[]
[]
[]
[]
[]
[]
[]
[]
[]
[]
[]
[]
[]
[]
[]
[]
[]
[]
[]
[]
[]
[]
[]
[]
[]
[]
[]
[]
[]
[]
[]
[]
[]
[]
[]
[]
[]
[]
[]
[]
[]
[]
[]
[]
[]
[]
[]
[]
[]
[]
[]
[]
[]
[]
[]
[]
[]
[]
[]
[]
[]
[]
[]
[]
[]
[]
[]
[]
[]
[]
[]
[]
[]
[]
[]
[]
[]
[]
[]
[]
[]
[]
[]
[]
[]
[]
[]
[]
[]
[]
[]
[]
[]
[]
[]
[]
[]
[]
[]
[]
[]
[]
[]
[]
[]
[]
[]
[]
[]
[]
[]
[]
[]
[]
[]
[]
[]
[]
[]
[]
[]
[]
[]
[]
[]
[]
[]
[]
[]
[]
[]
[]
[]
[]
[]
[]
[]
[]
[]
[]
[]
[]
[]
[]
[]
[]
[]
[]
[]
[]
[]
[]
[]
[]
[]
[]
[]
[]
[]
[]
[]
[]
[]
[]
[]
[]
[]
[]
[]
[]
[]
[]
[]
[]
[]
[]
[]
[]
[]
[]
[]
[]
[]
[]
[]
[]
[]
[]
[]
[]
[]
[]
[]
[]
[]
[]
[]
[]
[]
[]
[]
[]
[]
[]
[]
[]
[]
[]
[]
[]
[]
[]
[]
[]
[]
[]
[]
[]
[]
[]
[]
[]
[]
[]
[]
[]
[]
[]
[]
[]
[]
[]
[]
[]
[]
[]
[]
[]
[]
[]
[]
[]
[]
[]
[]
[]
[]
[]
[]
[]
[]
[]
[]
[]
[]
[]
[]
[]
[]
[]
[]
[]
[]
[]
[]
[]
[]
[]
[]
[]
[]
[]
[]
[]
[]
[]
[]
[]
[]
[]
[]
[]
[]
[]
[]
[]
[]
[]
[]
[]
[]
[]
[]
[]
[]
[]
[]
[]
[]
[]
[]
[]
[]
[]
[]
[]
[]
[]
[]
[]
[]
[]
[]
[]
[]
[]
[]
[]
[]
[]
[]
[]
[]
[]
[]
[]
[]
[]
[]
[]
[]
[]
[]
[]
[]
[]
[]
[]
[]
[]
[]
[]
[]
[]
[]
[]
[]
[]
[]
[]
[]
[]
[]
[]
[]
[]
[]
[]
[]
[]
[]
[]
[]
[]
[]
[]
[]
[]
[]
[]
[]
[]
[]
[]
[]
[]
[]
[]
[]
[]
[]
[]
[]
[]
[]
[]
[]
[]
[]
[]
[]
[]
[]
[]
[]
[]
[]
[]
[]
[]
[]
[]
[]
[]
[]
[]
[]
[]
[]
[]
[]
[]
[]
[]
[]
[]
[]
[]
[]
[]
[]
[]
[]
[]
[]
[]
[]
[]
[]
[]
[]
[]
[]
[]
[]
[]
[]
[]
[]
[]
[]
[]
[]
[]
[]
[]
[]
[]
[]
[]
[]
[]
[]
[]
[]
[]
[]
[]
[]
[]
[]
[]
[]
[]
[]
[]
[]
[]
[]
[]
[]
[]
[]
[]
[]
[]
[]
[]
[]
[]
[]
[]
[]
[]
[]
[]
[]
[]
[]
[]
[]
[]
[]
[]
[]
[]
[]
[]
[]
[]
[]
[]
[]
[]
[]
[]
[]
[]
[]
[]
[]
[]
[]
[]
[]
[]
[]
[]
[]
[]
[]
[]
[]
[]
[]
[]
[]
[]
[]
[]
[]
[]
[]
[]
[]
[]
[]
[]
[]
[]
[]
[]
[]
[]
[]
[]
[]
[]
[]
[]
[]
[]
[]
[null,{"$f":"IF(AND(COUNTA(ID!A3:XX113)=470,COUNTA(ID!A115:XX225)=470),XY6000,\"#\")","v":0}]
[]
[]
[]
[]
[]
[]
[]
[]
[]
[]
[]
[]
[]
[]
[]
[]
[]
[]
[]
[]
[]
[]
[]
[]
[]
[]
[]
[]
[]
[]
[]
[]
[]
[]
[]
[]
[]
[]
[]
[]
[]
[]
[]
[]
[]
[]
[]
[]
[]
[]
[]
[]
[]
[]
[]
[]
[]
[]
[]
[]
[]
[]
[]
[]
[]
[]
[]
[]
[]
[]
[]
[]
[]
[]
[]
[]
[]
[]
[]
[]
[]
[]
[]
[]
[]
[]
[]
[]
[]
[]
[]
[]
[]
[]
[]
[]
[]
[]
[]
[]
[]
[]
[]
[]
[]
[]
[]
[]
[]
[]
[]
[]
[]
[]
[]
[]
[]
[]
[]
[]
[]
[]
[]
[]
[]
[]
[]
[]
[]
[]
[]
[]
[]
[]
[]
[]
[]
[]
[]
[]
[]
[]
[]
[]
[]
[]
[]
[]
[]
[]
[]
[]
[]
[]
[]
[]
[]
[]
[]
[]
[]
[]
[]
[]
[]
[]
[]
[]
[]
[]
[]
[]
[]
[]
[]
[]
[]
[]
[]
[]
[]
[]
[]
[]
[]
[]
[]
[]
[]
[]
[]
[]
[]
[]
[]
[]
[]
[]
[]
[]
[]
[]
[]
[]
[]
[]
[]
[]
[]
[]
[]
[]
[]
[]
[]
[]
[]
[]
[]
[]
[]
[]
[]
[]
[]
[]
[]
[]
[]
[]
[]
[]
[]
[]
[]
[]
[]
[]
[]
[]
[]
[]
[]
[]
[]
[]
[]
[]
[]
[]
[]
[]
[]
[]
[]
[]
[]
[]
[]
[]
[]
[]
[]
[]
[]
[]
[]
[]
[]
[]
[]
[]
[]
[]
[]
[]
[]
[]
[]
[]
[]
[]
[]
[]
[]
[]
[]
[]
[]
[]
[]
[]
[]
[]
[]
[]
[]
[]
[]
[]
[]
[]
[]
[]
[]
[]
[]
[]
[]
[]
[]
[]
[]
[]
[]
[]
[]
[]
[]
[]
[]
[]
[]
[]
[]
[]
[]
[]
[]
[]
[]
[]
[]
[]
[]
[]
[]
[]
[]
[]
[]
[]
[]
[]
[]
[]
[]
[]
[]
[]
[]
[]
[]
[]
[]
[]
[]
[]
[]
[]
[]
[]
[]
[]
[]
[]
[]
[]
[]
[]
[]
[]
[]
[]
[]
[]
[]
[]
[]
[]
[]
[]
[]
[]
[]
[]
[]
[]
[]
[]
[]
[]
[]
[]
[]
[]
[]
[]
[]
[]
[]
[]
[]
[]
[]
[]
[]
[]
[]
[]
[]
[]
[]
[]
[]
[]
[]
[]
[]
[]
[]
[]
[]
[]
[]
[]
[]
[]
[]
[]
[]
[]
[]
[]
[]
[]
[]
[]
[]
[]
[]
[]
[]
[]
[]
[]
[]
[]
[]
[]
[]
[]
[]
[]
[]
[]
[]
[]
[]
[]
[]
[]
[]
[]
[]
[]
[]
[]
[]
[]
[]
[]
[]
[]
[]
[]
[]
[]
[]
[]
[]
[]
[]
[]
[]
[]
[]
[]
[]
[]
[]
[]
[]
[]
[]
[]
[]
[]
[]
[]
[]
[]
[]
[]
[]
[]
[]
[]
[]
[]
[]
[]
[]
[]
[]
[]
[]
[]
[]
[]
[]
[]
[]
[]
[]
[]
[]
[]
[]
[]
[]
[]
[]
[]
[]
[]
[]
[]
[]
[]
[]
[]
[]
[]
[]
[]
[]
[]
[]
[]
[]
[]
[]
[]
[]
[]
[]
[]
[]
[]
[]
[]
[]
[]
[]
[]
[]
[]
[]
[]
[]
[]
[]
[]
[]
[]
[]
[]
[]
[]
[]
[]
[]
[]
[]
[]
[]
[]
[]
[]
[]
[]
[]
[]
[]
[]
[]
[]
[]
[]
[]
[]
[]
[]
[]
[]
[]
[]
[]
[]
[]
[]
[]
[]
[]
[]
[]
[]
[]
[]
[]
[]
[]
[]
[]
[]
[]
[]
[]
[]
[]
[]
[]
[]
[]
[]
[]
[]
[]
[]
[]
[]
[]
[]
[]
[]
[]
[]
[]
[]
[]
[]
[]
[]
[]
[]
[]
[]
[]
[]
[]
[]
[]
[]
[]
[]
[]
[]
[]
[]
[]
[]
[]
[]
[]
[]
[]
[]
[]
[]
[]
[]
[]
[]
[]
[]
[]
[]
[]
[]
[]
[]
[]
[]
[]
[]
[]
[]
[]
[]
[]
[]
[]
[]
[]
[]
[]
[]
[]
[]
[]
[]
[]
[]
[]
[]
[]
[]
[]
[]
[]
[]
[]
[]
[]
[]
[]
[]
[]
[]
[]
[]
[]
[]
[]
[]
[]
[]
[]
[]
[]
[]
[]
[]
[]
[]
[]
[]
[]
[]
[]
[]
[]
[]
[]
[]
[]
[]
[]
[]
[]
[]
[]
[]
[]
[]
[]
[]
[]
[]
[]
[]
[]
[]
[]
[]
[]
[]
[]
[]
[]
[]
[]
[]
[]
[]
[]
[]
[]
[]
[]
[]
[]
[]
[]
[]
[]
[]
[]
[]
[]
[]
[]
[]
[]
[]
[]
[]
[]
[]
[]
[]
[]
[]
[]
[]
[]
[]
[]
[]
[]
[]
[]
[]
[]
[]
[]
[]
[]
[]
[]
[]
[]
[]
[]
[]
[]
[]
[]
[]
[]
[]
[]
[]
[]
[]
[]
[]
[]
[]
[]
[]
[]
[]
[]
[]
[]
[]
[]
[]
[]
[]
[]
[]
[]
[]
[]
[]
[]
[]
[]
[]
[]
[]
[]
[]
[]
[]
[]
[]
[]
[]
[]
[]
[]
[]
[]
[]
[]
[]
[]
[]
[]
[]
[]
[]
[]
[]
[]
[]
[]
[]
[]
[]
[]
[]
[]
[]
[]
[]
[]
[]
[]
[]
[]
[]
[]
[]
[]
[]
[]
[]
[]
[]
[]
[]
[]
[]
[]
[]
[]
[]
[]
[]
[]
[]
[]
[]
[]
[]
[]
[]
[]
[]
[]
[]
[]
[]
[]
[]
[]
[]
[]
[]
[]
[]
[]
[]
[]
[]
[]
[]
[]
[]
[]
[]
[]
[]
[]
[]
[]
[]
[]
[]
[]
[]
[]
[]
[]
[]
[]
[]
[]
[]
[]
[]
[]
[]
[]
[]
[]
[]
[]
[]
[]
[]
[]
[]
[]
[null,{"$f":"IF(SUM(B4001:B4010)=112,XY6000,\"#\")","v":0}]
[null,{"$f":"COUNTA(Info!A1:I4)","v":36}]
[null,{"$f":"COUNTA(Info!A1:A18)","v":18}]
[null,{"$f":"COUNTA(Info!I1:I18)","v":18}]
[null,{"$f":"COUNTA(Info!F5:G5)","v":2}]
[null,{"$f":"COUNTA(Info!F7:G9)","v":6}]
[null,{"$f":"COUNTA(Info!E10:G10)","v":3}]
[null,{"$f":"COUNTA(Info!A11:I11)","v":9}]
[null,{"$f":"COUNTA(Info!A15:I15)","v":9}]
[null,{"$f":"COUNTA(Info!F16:G16)","v":2}]
[null,{"$f":"COUNTA(Info!A17:I17)","v":9}]
[]
[]
[]
[]
[]
[]
[]
[]
[]
[]
[]
[]
[]
[]
[]
[]
[]
[]
[]
[]
[]
[]
[]
[]
[]
[]
[]
[]
[]
[]
[]
[]
[]
[]
[]
[]
[]
[]
[]
[]
[]
[]
[]
[]
[]
[]
[]
[]
[]
[]
[]
[]
[]
[]
[]
[]
[]
[]
[]
[]
[]
[]
[]
[]
[]
[]
[]
[]
[]
[]
[]
[]
[]
[]
[]
[]
[]
[]
[]
[]
[]
[]
[]
[]
[]
[]
[]
[]
[]
[]
[]
[]
[]
[]
[]
[]
[]
[]
[]
[]
[]
[]
[]
[]
[]
[]
[]
[]
[]
[]
[]
[]
[]
[]
[]
[]
[]
[]
[]
[]
[]
[]
[]
[]
[]
[]
[]
[]
[]
[]
[]
[]
[]
[]
[]
[]
[]
[]
[]
[]
[]
[]
[]
[]
[]
[]
[]
[]
[]
[]
[]
[]
[]
[]
[]
[]
[]
[]
[]
[]
[]
[]
[]
[]
[]
[]
[]
[]
[]
[]
[]
[]
[]
[]
[]
[]
[]
[]
[]
[]
[]
[]
[]
[]
[]
[]
[]
[]
[]
[]
[]
[]
[]
[]
[]
[]
[]
[]
[]
[]
[]
[]
[]
[]
[]
[]
[]
[]
[]
[]
[]
[]
[]
[]
[]
[]
[]
[]
[]
[]
[]
[]
[]
[]
[]
[]
[]
[]
[]
[]
[]
[]
[]
[]
[]
[]
[]
[]
[]
[]
[]
[]
[]
[]
[]
[]
[]
[]
[]
[]
[]
[]
[]
[]
[]
[]
[]
[]
[]
[]
[]
[]
[]
[]
[]
[]
[]
[]
[]
[]
[]
[]
[]
[]
[]
[]
[]
[]
[]
[]
[]
[]
[]
[]
[]
[]
[]
[]
[]
[]
[]
[]
[]
[]
[]
[]
[]
[]
[]
[]
[]
[]
[]
[]
[]
[]
[]
[]
[]
[]
[]
[]
[]
[]
[]
[]
[]
[]
[]
[]
[]
[]
[]
[]
[]
[]
[]
[]
[]
[]
[]
[]
[]
[]
[]
[]
[]
[]
[]
[]
[]
[]
[]
[]
[]
[]
[]
[]
[]
[]
[]
[]
[]
[]
[]
[]
[]
[]
[]
[]
[]
[]
[]
[]
[]
[]
[]
[]
[]
[]
[]
[]
[]
[]
[]
[]
[]
[]
[]
[]
[]
[]
[]
[]
[]
[]
[]
[]
[]
[]
[]
[]
[]
[]
[]
[]
[]
[]
[]
[]
[]
[]
[]
[]
[]
[]
[]
[]
[]
[]
[]
[]
[]
[]
[]
[]
[]
[]
[]
[]
[]
[]
[]
[]
[]
[]
[]
[]
[]
[]
[]
[]
[]
[]
[]
[]
[]
[]
[]
[]
[]
[]
[]
[]
[]
[]
[]
[]
[]
[]
[]
[]
[]
[]
[]
[]
[]
[]
[]
[]
[]
[]
[]
[]
[]
[]
[]
[]
[]
[]
[]
[]
[]
[]
[]
[]
[]
[]
[]
[]
[]
[]
[]
[]
[]
[]
[]
[]
[]
[]
[]
[]
[]
[]
[]
[]
[]
[]
[]
[]
[]
[]
[]
[]
[]
[]
[]
[]
[]
[]
[]
[]
[]
[]
[]
[]
[]
[]
[]
[]
[]
[]
[]
[]
[]
[]
[]
[]
[]
[]
[]
[]
[]
[]
[]
[]
[]
[]
[]
[]
[]
[]
[]
[]
[]
[]
[]
[]
[]
[]
[]
[]
[]
[]
[]
[]
[]
[]
[]
[]
[]
[]
[]
[]
[]
[]
[]
[]
[]
[]
[]
[]
[]
[]
[]
[]
[]
[]
[]
[]
[]
[]
[]
[]
[]
[]
[]
[]
[]
[]
[]
[]
[]
[]
[]
[]
[]
[]
[]
[]
[]
[]
[]
[]
[]
[]
[]
[]
[]
[]
[]
[]
[]
[]
[]
[]
[]
[]
[]
[]
[]
[]
[]
[]
[]
[]
[]
[]
[]
[]
[]
[]
[]
[]
[]
[]
[]
[]
[]
[]
[]
[]
[]
[]
[]
[]
[]
[]
[]
[]
[]
[]
[]
[]
[]
[]
[]
[]
[]
[]
[]
[]
[]
[]
[]
[]
[]
[]
[]
[]
[]
[]
[]
[]
[]
[]
[]
[]
[]
[]
[]
[]
[]
[]
[]
[]
[]
[]
[]
[]
[]
[]
[]
[]
[]
[]
[]
[]
[]
[]
[]
[]
[]
[]
[]
[]
[]
[]
[]
[]
[]
[]
[]
[]
[]
[]
[]
[]
[]
[]
[]
[]
[]
[]
[]
[]
[]
[]
[]
[]
[]
[]
[]
[]
[]
[]
[]
[]
[]
[]
[]
[]
[]
[]
[]
[]
[]
[]
[]
[]
[]
[]
[]
[]
[]
[]
[]
[]
[]
[]
[]
[]
[]
[]
[]
[]
[]
[]
[]
[]
[]
[]
[]
[]
[]
[]
[]
[]
[]
[]
[]
[]
[]
[]
[]
[]
[]
[]
[]
[]
[]
[]
[]
[]
[]
[]
[]
[]
[]
[]
[]
[]
[]
[]
[]
[]
[]
[]
[]
[]
[]
[]
[]
[]
[]
[]
[]
[]
[]
[]
[]
[]
[]
[]
[]
[]
[]
[]
[]
[]
[]
[]
[]
[]
[]
[]
[]
[]
[]
[]
[]
[]
[]
[]
[]
[]
[]
[]
[]
[]
[]
[]
[]
[]
[]
[]
[]
[]
[]
[]
[]
[]
[]
[]
[]
[]
[]
[]
[]
[]
[]
[]
[]
[]
[]
[]
[]
[]
[]
[]
[]
[]
[]
[]
[]
[]
[]
[]
[]
[]
[]
[]
[]
[]
[]
[]
[]
[]
[]
[]
[]
[]
[]
[]
[]
[]
[]
[]
[]
[]
[]
[]
[]
[]
[]
[]
[]
[]
[]
[]
[]
[]
[]
[]
[]
[]
[]
[]
[]
[]
[]
[]
[]
[]
[]
[]
[]
[]
[]
[]
[]
[]
[]
[]
[]
[]
[]
[]
[]
[]
[]
[]
[]
[]
[]
[]
[]
[]
[]
[]
[]
[]
[]
[]
[]
[]
[]
[]
[]
[]
[]
[]
[]
[]
[]
[]
[]
[]
[]
[]
[]
[]
[]
[]
[]
[]
[]
[]
[]
[null,null,null,null,null,null,null,null,null,null,null,null,null,null,null,null,null,null,null,null,null,null,null,null,null,null,null,null,null,null,null,null,null,null,null,null,null,null,null,null,null,null,null,null,null,null,null,null,null,null,null,null,null,null,null,null,null,null,null,null,null,null,null,null,null,null,null,null,null,null,null,null,null,null,null,null,null,null,null,null,null,null,null,null,null,null,null,null,null,null,null,null,null,null,null,null,null,null,null,null,null,null,null,null,null,null,null,null,null,null,null,null,null,null,null,null,null,null,null,null,null,null,null,null,null,null,null,null,null,null,null,null,null,null,null,null,null,null,null,null,null,null,null,null,null,null,null,null,null,null,null,null,null,null,null,null,null,null,null,null,null,null,null,null,null,null,null,null,null,null,null,null,null,null,null,null,null,null,null,null,null,null,null,null,null,null,null,null,null,null,null,null,null,null,null,null,null,null,null,null,null,null,null,null,null,null,null,null,null,null,null,null,null,null,null,null,null,null,null,null,null,null,null,null,null,null,null,null,null,null,null,null,null,null,null,null,null,null,null,null,null,null,null,null,null,null,null,null,null,null,null,null,null,null,null,null,null,null,null,null,null,null,null,null,null,null,null,null,null,null,null,null,null,null,null,null,null,null,null,null,null,null,null,null,null,null,null,null,null,null,null,null,null,null,null,null,null,null,null,null,null,null,null,null,null,null,null,null,null,null,null,null,null,null,null,null,null,null,null,null,null,null,null,null,null,null,null,null,null,null,null,null,null,null,null,null,null,null,null,null,null,null,null,null,null,null,null,null,null,null,null,null,null,null,null,null,null,null,null,null,null,null,null,null,null,null,null,null,null,null,null,null,null,null,null,null,null,null,null,null,null,null,null,null,null,null,null,null,null,null,null,null,null,null,null,null,null,null,null,null,null,null,null,null,null,null,null,null,null,null,null,null,null,null,null,null,null,null,null,null,null,null,null,null,null,null,null,null,null,null,null,null,null,null,null,null,null,null,null,null,null,null,null,null,null,null,null,null,null,null,null,null,null,null,null,null,null,null,null,null,null,null,null,null,null,null,null,null,null,null,null,null,null,null,null,null,null,null,null,null,null,null,null,null,null,null,null,null,null,null,null,null,null,null,null,null,null,null,null,null,null,null,null,null,null,null,null,null,null,null,null,null,null,null,null,null,null,null,null,null,null,null,null,null,null,null,null,null,null,null,null,null,null,null,null,null,null,null,null,null,null,null,null,null,null,null,null,null,null,null,null,null,null,null,null,null,null,null,null,null,null,null,null,null,null,null,null,null,null,null,null,null,null,null,null,null,null,null,null,null,null,null,null,null,null,null,null,null,null,null,null,null,null,null,null,null,null,null,null,null,null,null,null,null,null,null,null,null,null,null,null,null,null,null,null,null,null,null,null,null,null,null,null,null,null,null,null,null,null,null,null,null,null,null,null,null,null,null,null,null,null,null,null,null,null,null,null,null,"info@xclmedia.com"]
[]
[]
[]
[]
[]
[]
[]
[]
[]
[]
[]
[]
[]
[]
[]
[]
[]
[]
[]
[]
[]
[]
[]
[]
[]
[]
[]
[]
[]
[]
[]
[]
[]
[]
[]
[]
[]
[]
[]
[]
[]
[]
[]
[]
[]
[]
[]
[]
[]
[]
[]
[]
[]
[]
[]
[]
[]
[]
[]
[]
[]
[]
[]
[]
[]
[]
[]
[]
[]
[]
[]
[]
[]
[]
[]
[]
[]
[]
[]
[]
[]
[]
[]
[]
[]
[]
[]
[]
[]
[]
[]
[]
[]
[]
[]
[]
[]
[]
[]
[]
[]
[]
[]
[]
[]
[]
[]
[]
[]
[]
[]
[]
[]
[]
[]
[]
[]
[]
[]
[]
[]
[]
[]
[]
[]
[]
[]
[]
[]
[]
[]
[]
[]
[]
[]
[]
[]
[]
[]
[]
[]
[]
[]
[]
[]
[]
[]
[]
[]
[]
[]
[]
[]
[]
[]
[]
[]
[]
[]
[]
[]
[]
[]
[]
[]
[]
[]
[]
[]
[]
[]
[]
[]
[]
[]
[]
[]
[]
[]
[]
[]
[]
[]
[]
[]
[]
[]
[]
[]
[]
[]
[]
[]
[]
[]
[]
[]
[]
[]
[]
[]
[]
[]
[]
[]
[]
[]
[]
[]
[]
[]
[]
[]
[]
[]
[]
[]
[]
[]
[]
[]
[]
[]
[]
[]
[]
[]
[]
[]
[]
[]
[]
[]
[]
[]
[]
[]
[]
[]
[]
[]
[]
[]
[]
[]
[]
[]
[]
[]
[]
[]
[]
[]
[]
[]
[]
[]
[]
[]
[]
[]
[]
[]
[]
[]
[]
[]
[]
[]
[]
[]
[]
[]
[]
[]
[]
[]
[]
[]
[]
[]
[]
[]
[]
[]
[]
[]
[]
[]
[]
[]
[]
[]
[]
[]
[]
[]
[]
[]
[]
[]
[]
[]
[]
[]
[]
[]
[]
[]
[]
[]
[]
[]
[]
[]
[]
[]
[]
[]
[]
[]
[]
[]
[]
[]
[]
[]
[]
[]
[]
[]
[]
[]
[]
[]
[]
[]
[]
[]
[]
[]
[]
[]
[]
[]
[]
[]
[]
[]
[]
[]
[]
[]
[]
[]
[]
[]
[]
[]
[]
[]
[]
[]
[]
[]
[]
[]
[]
[]
[]
[]
[]
[]
[]
[]
[]
[]
[]
[]
[]
[]
[]
[]
[]
[]
[]
[]
[]
[]
[]
[]
[]
[]
[]
[]
[]
[]
[]
[]
[]
[]
[]
[]
[]
[]
[]
[]
[]
[]
[]
[]
[]
[]
[]
[]
[]
[]
[]
[]
[]
[]
[]
[]
[]
[]
[]
[]
[]
[]
[]
[]
[]
[]
[]
[]
[]
[]
[]
[]
[]
[]
[]
[]
[]
[]
[]
[]
[]
[]
[]
[]
[]
[]
[]
[]
[]
[]
[]
[]
[]
[]
[]
[]
[]
[]
[]
[]
[]
[]
[]
[]
[]
[]
[]
[]
[]
[]
[]
[]
[]
[]
[]
[]
[]
[]
[]
[]
[]
[]
[]
[]
[]
[]
[]
[]
[]
[]
[]
[]
[]
[]
[]
[]
[]
[]
[]
[]
[]
[]
[]
[]
[]
[]
[]
[]
[]
[]
[]
[]
[]
[]
[]
[]
[]
[]
[]
[]
[]
[]
[]
[]
[]
[]
[]
[]
[]
[]
[]
[]
[]
[]
[]
[]
[]
[]
[]
[]
[]
[]
[]
[]
[]
[]
[]
[]
[]
[]
[]
[]
[]
[]
[]
[]
[]
[]
[]
[]
[]
[]
[]
[]
[]
[]
[]
[]
[]
[]
[]
[]
[]
[]
[]
[]
[]
[]
[]
[]
[]
[]
[]
[]
[]
[]
[]
[]
[]
[]
[]
[]
[]
[]
[]
[]
[]
[]
[]
[]
[]
[]
[]
[]
[]
[]
[]
[]
[]
[]
[]
[]
[]
[]
[]
[]
[]
[]
[]
[]
[]
[]
[]
[]
[]
[]
[]
[]
[]
[]
[]
[]
[]
[]
[]
[]
[]
[]
[]
[]
[]
[]
[]
[]
[]
[]
[]
[]
[]
[]
[]
[]
[]
[]
[]
[]
[]
[]
[]
[]
[]
[]
[]
[]
[]
[]
[]
[]
[]
[]
[]
[]
[]
[]
[]
[]
[]
[]
[]
[]
[]
[]
[]
[]
[]
[]
[]
[]
[]
[]
[]
[]
[]
[]
[]
[]
[]
[]
[]
[]
[]
[]
[]
[]
[]
[]
[]
[]
[]
[]
[]
[]
[]
[]
[]
[]
[]
[]
[]
[]
[]
[]
[]
[]
[]
[]
[]
[]
[]
[]
[]
[]
[]
[]
[]
[]
[]
[]
[]
[]
[]
[]
[]
[]
[]
[]
[]
[]
[]
[]
[]
[]
[]
[]
[]
[]
[]
[]
[]
[]
[]
[]
[]
[]
[]
[]
[]
[]
[]
[]
[]
[]
[]
[]
[]
[]
[]
[]
[]
[]
[]
[]
[]
[]
[]
[]
[]
[]
[]
[]
[]
[]
[]
[]
[]
[]
[]
[]
[]
[]
[]
[]
[]
[]
[]
[]
[]
[]
[]
[]
[]
[]
[]
[]
[]
[]
[]
[]
[]
[]
[]
[]
[]
[]
[]
[]
[]
[]
[]
[]
[]
[]
[]
[]
[]
[]
[]
[]
[]
[]
[]
[]
[]
[]
[]
[]
[]
[]
[]
[]
[]
[]
[]
[]
[]
[]
[]
[]
[]
[]
[]
[]
[]
[]
[]
[]
[]
[]
[]
[]
[]
[]
[]
[]
[]
[]
[]
[]
[]
[]
[]
[]
[]
[]
[]
[]
[]
[]
[]
[]
[]
[]
[]
[]
[]
[]
[]
[]
[]
[]
[]
[]
[]
[]
[]
[]
[]
[]
[]
[]
[]
[]
[]
[]
[]
[]
[]
[]
[]
[]
[]
[]
[]
[]
[]
[]
[]
[]
[]
[]
[]
[]
[]
[]
[]
[]
[]
[]
[]
[]
[]
[]
[]
[]
[]
[]
[]
[]
[]
[]
[]
[]
[]
[]
[]
[]
[]
[]
[]
[]
[]
[]
[]
[]
[]
[]
[]
[]
[]
[]
[]
[]
[]
[]
[]
[]
[]
[]
[]
[]
[]
[]
[]
[]
[]
[]
[]
[]
[]
[]
[]
[]
[null,null,null,null,null,null,null,null,null,null,null,null,null,null,null,null,null,null,null,null,null,null,null,null,null,null,null,null,null,null,null,null,null,null,null,null,null,null,null,null,null,null,null,null,null,null,null,null,null,null,null,null,null,null,null,null,null,null,null,null,null,null,null,null,null,null,null,null,null,null,null,null,null,null,null,null,null,null,null,null,null,null,null,null,null,null,null,null,null,null,null,null,null,null,null,null,null,null,null,null,null,null,null,null,null,null,null,null,null,null,null,null,null,null,null,null,null,null,null,null,null,null,null,null,null,null,null,null,null,null,null,null,null,null,null,null,null,null,null,null,null,null,null,null,null,null,null,null,null,null,null,null,null,null,null,null,null,null,null,null,null,null,null,null,null,null,null,null,null,null,null,null,null,null,null,null,null,null,null,null,null,null,null,null,null,null,null,null,null,null,null,null,null,null,null,null,null,null,null,null,null,null,null,null,null,null,null,null,null,null,null,null,null,null,null,null,null,null,null,null,null,null,null,null,null,null,null,null,null,null,null,null,null,null,null,null,null,null,null,null,null,null,null,null,null,null,null,null,null,null,null,null,null,null,null,null,null,null,null,null,null,null,null,null,null,null,null,null,null,null,null,null,null,null,null,null,null,null,null,null,null,null,null,null,null,null,null,null,null,null,null,null,null,null,null,null,null,null,null,null,null,null,null,null,null,null,null,null,null,null,null,null,null,null,null,null,null,null,null,null,null,null,null,null,null,null,null,null,null,null,null,null,null,null,null,null,null,null,null,null,null,null,null,null,null,null,null,null,null,null,null,null,null,null,null,null,null,null,null,null,null,null,null,null,null,null,null,null,null,null,null,null,null,null,null,null,null,null,null,null,null,null,null,null,null,null,null,null,null,null,null,null,null,null,null,null,null,null,null,null,null,null,null,null,null,null,null,null,null,null,null,null,null,null,null,null,null,null,null,null,null,null,null,null,null,null,null,null,null,null,null,null,null,null,null,null,null,null,null,null,null,null,null,null,null,null,null,null,null,null,null,null,null,null,null,null,null,null,null,null,null,null,null,null,null,null,null,null,null,null,null,null,null,null,null,null,null,null,null,null,null,null,null,null,null,null,null,null,null,null,null,null,null,null,null,null,null,null,null,null,null,null,null,null,null,null,null,null,null,null,null,null,null,null,null,null,null,null,null,null,null,null,null,null,null,null,null,null,null,null,null,null,null,null,null,null,null,null,null,null,null,null,null,null,null,null,null,null,null,null,null,null,null,null,null,null,null,null,null,null,null,null,null,null,null,null,null,null,null,null,null,null,null,null,null,null,null,null,null,null,null,null,null,null,null,null,null,null,null,null,null,null,null,null,null,null,null,null,null,null,null,null,null,null,null,null,null,null,null,null,null,null,null,null,null,null,null,null,null,null,null,null,null,null,null,null,null,null,null,null,null,null,null,null,null,null,null,null,null,null,null,null,null,null,null,null,null,null,{"$f":"IF(NOW()>LARGE(XZ6000,1),\"#\",0)","v":0},55152]