{"text_format":"1","workbook":"xlsx","n_sheets":5,"sheets":["ID","Info","Data","Arus Kas","HD"],"not_rendered":{"charts":0,"images":3,"macros":1,"external_links":4,"defined_names":105,"comments":0,"pivot_tables":0},"unopened":[],"bounds":{"document_bytes":16777216,"sheet_cells":100000,"rows_first":2000,"rows_last":500,"rows_between":2000,"halvings":0,"cell_chars":16384,"cell_head_chars":4096},"cells_cut":0,"cells_raw":0,"read":"whole","date_system":"1900"}

{"sheet":"ID","index":0,"n_rows":501,"n_cols":156,"rows_kept":501,"cut":false,"hidden":true,"merged":[]}
[]
[null,null,null,null,null,null,null,null,null,null,null,null,null,null,null,null,null,null,null,null,null,null,null,null,null,null,null,null,null,null,null,null,null,null,null,null,null,null,null,null,null,null,null,null,null,null,null,null,null,null,{"$f":"IF(OR(AZ2=\"KODE\",AZ2=\"\"),\"-\",COUNTA(AZ$2:AZ2)-COUNTBLANK(AZ$2:AZ2))","v":"-"},{"$f":"IF(OR(INDEX(Data!A:A,0,1)=0,INDEX(Data!A:A,0,1)=\"-\"),\"\",INDEX(Data!A:A,0,1))","v":""},2,{"$f":"IF(ISNA(VLOOKUP(BA2,AY:AZ,2,FALSE)),\"-\",VLOOKUP(BA2,AY:AZ,2,FALSE))","v":"KAS"},null,null,null,null,null,null,null,null,null,null,null,null,null,null,null,null,null,null,null,null,null,null,null,null,null,null,null,null,null,null,null,null,null,null,null,null,null,null,null,null,null,null,null,null,null,null,null,null,null,null,null,null,null,null,null,null,null,null,null,null,null,null,null,null,null,null,null,null,null,null,null,null,null,null,null,null,null,null,null,null,null,null,null,null,null,null,null,null,null,null,null,null,null,null,null,null,null,null,null,null,null,{"$f":"IF(Info!D5<>0,Info!D5,\"Nama Perusahaan\")","v":"PT. EXPRESS GEMBOL"}]
[null,null,null,null,null,null,null,null,null,null,null,null,null,null,null,null,null,null,null,null,null,null,null,null,null,null,null,null,null,null,null,null,null,null,null,null,null,null,null,null,null,null,null,null,null,null,null,null,null,null,{"$f":"IF(OR(AZ3=\"-\",AZ3=\"\"),\"-\",COUNTA(AZ$2:AZ3)-COUNTBLANK(AZ$2:AZ3))","v":1},{"$f":"IF(OR(INDEX(Data!A:A,0,1)=0,INDEX(Data!A:A,0,1)=\"-\"),\"\",INDEX(Data!A:A,0,1))","v":"KODE"},{"$f":"BA2+1","v":3},"OPR-01",null,null,null,null,null,null,null,null,null,null,null,null,null,null,null,null,null,null,null,null,null,null,null,null,null,null,null,null,null,null,null,null,null,null,null,null,null,null,null,null,null,null,null,null,null,null,null,null,null,null,{"$f":"IF(AND(HD!B2000=0,HD!B3000=0,HD!B4000=0),\"KAS\",\"#\")","v":"KAS"}]
[null,null,null,null,null,null,null,null,null,null,null,null,null,null,null,null,null,null,null,null,null,null,null,null,null,null,null,null,null,null,null,null,null,null,null,null,null,null,null,null,null,null,null,null,null,null,null,null,null,null,{"$f":"IF(OR(AZ4=\"-\",AZ4=\"\"),\"-\",COUNTA(AZ$2:AZ4)-COUNTBLANK(AZ$2:AZ4))","v":"-"},{"$f":"IF(OR(INDEX(Data!A:A,0,1)=0,INDEX(Data!A:A,0,1)=\"-\"),\"\",INDEX(Data!A:A,0,1))","v":""},{"$f":"BA3+1","v":4},"OPR-02"]
[null,null,null,null,null,null,null,null,null,null,null,null,null,null,null,null,null,null,null,null,null,null,null,null,null,null,null,null,null,null,null,null,null,null,null,null,null,null,null,null,null,null,null,null,null,null,null,null,null,null,{"$f":"IF(OR(AZ5=\"-\",AZ5=\"\"),\"-\",COUNTA(AZ$2:AZ5)-COUNTBLANK(AZ$2:AZ5))","v":"-"},{"$f":"IF(OR(INDEX(Data!A:A,0,1)=0,INDEX(Data!A:A,0,1)=\"-\"),\"\",INDEX(Data!A:A,0,1))","v":""},5,"OPR-03"]
[null,null,null,null,null,null,null,null,null,null,null,null,null,null,null,null,null,null,null,null,null,null,null,null,null,null,null,null,null,null,null,null,null,null,null,null,null,null,null,null,null,null,null,null,null,null,null,null,null,null,{"$f":"IF(OR(AZ6=\"-\",AZ6=\"\"),\"-\",COUNTA(AZ$2:AZ6)-COUNTBLANK(AZ$2:AZ6))","v":"-"},{"$f":"IF(OR(INDEX(Data!A:A,0,1)=0,INDEX(Data!A:A,0,1)=\"-\"),\"\",INDEX(Data!A:A,0,1))","v":""},6,"OPR-04"]
[null,null,null,null,null,null,null,null,null,null,null,null,null,null,null,null,null,null,null,null,null,null,null,null,null,null,null,null,null,null,null,null,null,null,null,null,null,null,null,null,null,null,null,null,null,null,null,null,null,null,{"$f":"IF(OR(AZ7=\"-\",AZ7=\"\"),\"-\",COUNTA(AZ$2:AZ7)-COUNTBLANK(AZ$2:AZ7))","v":2},{"$f":"IF(OR(INDEX(Data!A:A,0,1)=0,INDEX(Data!A:A,0,1)=\"-\"),\"\",INDEX(Data!A:A,0,1))","v":"KAS"},7,"OPR-05"]
[null,null,null,null,null,null,null,null,null,null,null,null,null,null,null,null,null,null,null,null,null,null,null,null,null,null,null,null,null,null,null,null,null,null,null,null,null,null,null,null,null,null,null,null,null,null,null,null,null,null,{"$f":"IF(OR(AZ8=\"-\",AZ8=\"\"),\"-\",COUNTA(AZ$2:AZ8)-COUNTBLANK(AZ$2:AZ8))","v":3},{"$f":"IF(OR(INDEX(Data!A:A,0,1)=0,INDEX(Data!A:A,0,1)=\"-\"),\"\",INDEX(Data!A:A,0,1))","v":"OPR-01"},{"$f":"BA7+1","v":8},"INV-01"]
[null,null,null,null,null,null,null,null,null,null,null,null,null,null,null,null,null,null,null,null,null,null,null,null,null,null,null,null,null,null,null,null,null,null,null,null,null,null,null,null,null,null,null,null,null,null,null,null,null,null,{"$f":"IF(OR(AZ9=\"-\",AZ9=\"\"),\"-\",COUNTA(AZ$2:AZ9)-COUNTBLANK(AZ$2:AZ9))","v":4},{"$f":"IF(OR(INDEX(Data!A:A,0,1)=0,INDEX(Data!A:A,0,1)=\"-\"),\"\",INDEX(Data!A:A,0,1))","v":"OPR-02"},9,"PNY"]
[null,null,null,null,null,null,null,null,null,null,null,null,null,null,null,null,null,null,null,null,null,null,null,null,null,null,null,null,null,null,null,null,null,null,null,null,null,null,null,null,null,null,null,null,null,null,null,null,null,null,{"$f":"IF(OR(AZ10=\"-\",AZ10=\"\"),\"-\",COUNTA(AZ$2:AZ10)-COUNTBLANK(AZ$2:AZ10))","v":5},{"$f":"IF(OR(INDEX(Data!A:A,0,1)=0,INDEX(Data!A:A,0,1)=\"-\"),\"\",INDEX(Data!A:A,0,1))","v":"OPR-03"},10,"INV-02"]
[null,null,null,null,null,null,null,null,null,null,null,null,null,null,null,null,null,null,null,null,null,null,null,null,null,null,null,null,null,null,null,null,null,null,null,null,null,null,null,null,null,null,null,null,null,null,null,null,null,null,{"$f":"IF(OR(AZ11=\"-\",AZ11=\"\"),\"-\",COUNTA(AZ$2:AZ11)-COUNTBLANK(AZ$2:AZ11))","v":6},{"$f":"IF(OR(INDEX(Data!A:A,0,1)=0,INDEX(Data!A:A,0,1)=\"-\"),\"\",INDEX(Data!A:A,0,1))","v":"OPR-04"},11,"OPR-06"]
[null,null,null,null,null,null,null,null,null,null,null,null,null,null,null,null,null,null,null,null,null,null,null,null,null,null,null,null,null,null,null,null,null,null,null,null,null,null,null,null,null,null,null,null,null,null,null,null,null,null,{"$f":"IF(OR(AZ12=\"-\",AZ12=\"\"),\"-\",COUNTA(AZ$2:AZ12)-COUNTBLANK(AZ$2:AZ12))","v":7},{"$f":"IF(OR(INDEX(Data!A:A,0,1)=0,INDEX(Data!A:A,0,1)=\"-\"),\"\",INDEX(Data!A:A,0,1))","v":"OPR-05"},12,"OPR-07"]
[null,null,null,null,null,null,null,null,null,null,null,null,null,null,null,null,null,null,null,null,null,null,null,null,null,null,null,null,null,null,null,null,null,null,null,null,null,null,null,null,null,null,null,null,null,null,null,null,null,null,{"$f":"IF(OR(AZ13=\"-\",AZ13=\"\"),\"-\",COUNTA(AZ$2:AZ13)-COUNTBLANK(AZ$2:AZ13))","v":"-"},{"$f":"IF(OR(INDEX(Data!A:A,0,1)=0,INDEX(Data!A:A,0,1)=\"-\"),\"\",INDEX(Data!A:A,0,1))","v":""},13,"OPR-08"]
[null,null,null,null,null,null,null,null,null,null,null,null,null,null,null,null,null,null,null,null,null,null,null,null,null,null,null,null,null,null,null,null,null,null,null,null,null,null,null,null,null,null,null,null,null,null,null,null,null,null,{"$f":"IF(OR(AZ14=\"-\",AZ14=\"\"),\"-\",COUNTA(AZ$2:AZ14)-COUNTBLANK(AZ$2:AZ14))","v":8},{"$f":"IF(OR(INDEX(Data!A:A,0,1)=0,INDEX(Data!A:A,0,1)=\"-\"),\"\",INDEX(Data!A:A,0,1))","v":"INV-01"},14,"OPR-09",null,null,null,null,null,null,null,null,null,null,null,null,null,null,null,null,null,null,null,null,null,null,null,null,null,null,null,null,null,null,null,null,null,null,null,null,null,null,null,null,null,null,null,null,null,null,null,null,null,null,null,null,null,null,null,null,null,null,null,null,null,null,null,null,null,null,null,null,null,null,null,null,null,null,null,null,null,null,null,null,null,null,null,null,null,null,null,null,null,null,null,null,null,null,null,null,null,null,null,null,null,{"$f":"IF(Info!D6<>0,\"Per \"&TEXT(Info!D6,\"dd-mmm-yyy\"),\"...................\")","v":"Per 31-Des-2015"}]
[null,null,null,null,null,null,null,null,null,null,null,null,null,null,null,null,null,null,null,null,null,null,null,null,null,null,null,null,null,null,null,null,null,null,null,null,null,null,null,null,null,null,null,null,null,null,null,null,null,null,{"$f":"IF(OR(AZ15=\"-\",AZ15=\"\"),\"-\",COUNTA(AZ$2:AZ15)-COUNTBLANK(AZ$2:AZ15))","v":9},{"$f":"IF(OR(INDEX(Data!A:A,0,1)=0,INDEX(Data!A:A,0,1)=\"-\"),\"\",INDEX(Data!A:A,0,1))","v":"PNY"},15,"DNA-01"]
{"$rows_left_out":487}
{"sheet":"Info","index":1,"n_rows":12,"n_cols":7,"rows_kept":12,"cut":false,"hidden":false,"merged":[[4,3,4,4],[9,3,9,4]]}
["  ","  ","  ","  ","  ","  ","  "]
["  ","  ","  ","  ","  ","  ","  "]
["  ","  ","  ","  ","  ","  ","  "]
["  ","  ","  ","  ","  ","  ","  "]
["  ","  ","PERUSAHAAN","PT. EXPRESS GEMBOL",null,"  ","  "]
["  ","  ","TGL LAPORAN 1","2015-12-31","  ","  ","  "]
["  ","  ","TGL LAPORAN 2","2016-12-31","  ","  ","  "]
["  ","  ","TGL LAPORAN 3","2017-12-31","  ","  ","  "]
["  ","  ","  ","  ","  ","  ","  "]
["  ","  ","USER","info@xclmedia.com",null,"  ","  "]
["  ","  ","  ","  ","  ","  ","  "]
[{"$f":"IF(REG=D10,\"Reg: \"&REG&\" - @copyright: xclmedia.com\",\"Reg: Error - @copyright: xclmedia.com\")","v":"Reg: info@xclmedia.com - @copyright: xclmedia.com"}]

{"sheet":"Data","index":2,"n_rows":73,"n_cols":11,"rows_kept":73,"cut":false,"hidden":false,"merged":[[2,4,2,6],[44,4,44,6]]}
[null,null,null,null,{"$f":"Perusahaan","v":"PT. EXPRESS GEMBOL"},null,null,null,null,null,"Copyright by xclmedia"]
[null,null,null,null,"NERACA"]
["KODE","ARUS KAS","NERACA",null,"POS-POS",null,null,{"$f":"Tanggal_1","v":"Per 31-Des-2015"},{"$f":"Tanggal_2","v":"Per 31-Des-2016"},{"$f":"Tanggal_3","v":"Per 31-Des-2017"}]
[{"$f":"IF(B4=BLK,TEXT,IF(B4=KAS,B4,IF(B4=LB_BERSIH,LBS,IF(B4=PENYU,PNY,IF(AND(B4=OPERA,COUNTIF(B$1:B4,B4)<O.O1),OPR_0&COUNTIF(B$1:B4,B4),IF(AND(B4=OPERA,COUNTIF(B$1:B4,B4)>O.O1),OPR_&COUNTIF(B$1:B4,B4),IF(AND(B4=INVES,COUNTIF(B$1:B4,B4)<O.O1),INV_0&COUNTIF(B$1:B4,B4),IF(AND(B4=INVES,COUNTIF(B$1:B4,B4)>O.O1),INV_&COUNTIF(B$1:B4,B4),IF(AND(B4=PENDA,COUNTIF(B$1:B4,B4)<O.O1),DNA_0&COUNTIF(B$1:B4,B4),IF(AND(B4=PENDA,COUNTIF(B$1:B4,B4)>O.O1),DNA_&COUNTIF(B$1:B4,B4),IF(AND(B4=LB_DTAHAN,COUNTIF(B$1:B4,B4)<O.O1),LBD_0&COUNTIF(B$1:B4,B4),IF(AND(B4=LB_DTAHAN,COUNTIF(B$1:B4,B4)>O.O1),LBD_&COUNTIF(B$1:B4,B4),TEXT))))))))))))","v":"-"}]
[{"$f":"IF(B5=BLK,TEXT,IF(B5=KAS,B5,IF(B5=LB_BERSIH,LBS,IF(B5=PENYU,PNY,IF(AND(B5=OPERA,COUNTIF(B$1:B5,B5)<O.O1),OPR_0&COUNTIF(B$1:B5,B5),IF(AND(B5=OPERA,COUNTIF(B$1:B5,B5)>O.O1),OPR_&COUNTIF(B$1:B5,B5),IF(AND(B5=INVES,COUNTIF(B$1:B5,B5)<O.O1),INV_0&COUNTIF(B$1:B5,B5),IF(AND(B5=INVES,COUNTIF(B$1:B5,B5)>O.O1),INV_&COUNTIF(B$1:B5,B5),IF(AND(B5=PENDA,COUNTIF(B$1:B5,B5)<O.O1),DNA_0&COUNTIF(B$1:B5,B5),IF(AND(B5=PENDA,COUNTIF(B$1:B5,B5)>O.O1),DNA_&COUNTIF(B$1:B5,B5),IF(AND(B5=LB_DTAHAN,COUNTIF(B$1:B5,B5)<O.O1),LBD_0&COUNTIF(B$1:B5,B5),IF(AND(B5=LB_DTAHAN,COUNTIF(B$1:B5,B5)>O.O1),LBD_&COUNTIF(B$1:B5,B5),TEXT))))))))))))","v":"-"},null,null,null,null,"ASET"]
[{"$f":"IF(B6=BLK,TEXT,IF(B6=KAS,B6,IF(B6=LB_BERSIH,LBS,IF(B6=PENYU,PNY,IF(AND(B6=OPERA,COUNTIF(B$1:B6,B6)<O.O1),OPR_0&COUNTIF(B$1:B6,B6),IF(AND(B6=OPERA,COUNTIF(B$1:B6,B6)>O.O1),OPR_&COUNTIF(B$1:B6,B6),IF(AND(B6=INVES,COUNTIF(B$1:B6,B6)<O.O1),INV_0&COUNTIF(B$1:B6,B6),IF(AND(B6=INVES,COUNTIF(B$1:B6,B6)>O.O1),INV_&COUNTIF(B$1:B6,B6),IF(AND(B6=PENDA,COUNTIF(B$1:B6,B6)<O.O1),DNA_0&COUNTIF(B$1:B6,B6),IF(AND(B6=PENDA,COUNTIF(B$1:B6,B6)>O.O1),DNA_&COUNTIF(B$1:B6,B6),IF(AND(B6=LB_DTAHAN,COUNTIF(B$1:B6,B6)<O.O1),LBD_0&COUNTIF(B$1:B6,B6),IF(AND(B6=LB_DTAHAN,COUNTIF(B$1:B6,B6)>O.O1),LBD_&COUNTIF(B$1:B6,B6),TEXT))))))))))))","v":"-"},null,null,null,null,"ASET LANCAR"]
[{"$f":"IF(B7=BLK,TEXT,IF(B7=KAS,B7,IF(B7=LB_BERSIH,LBS,IF(B7=PENYU,PNY,IF(AND(B7=OPERA,COUNTIF(B$1:B7,B7)<O.O1),OPR_0&COUNTIF(B$1:B7,B7),IF(AND(B7=OPERA,COUNTIF(B$1:B7,B7)>O.O1),OPR_&COUNTIF(B$1:B7,B7),IF(AND(B7=INVES,COUNTIF(B$1:B7,B7)<O.O1),INV_0&COUNTIF(B$1:B7,B7),IF(AND(B7=INVES,COUNTIF(B$1:B7,B7)>O.O1),INV_&COUNTIF(B$1:B7,B7),IF(AND(B7=PENDA,COUNTIF(B$1:B7,B7)<O.O1),DNA_0&COUNTIF(B$1:B7,B7),IF(AND(B7=PENDA,COUNTIF(B$1:B7,B7)>O.O1),DNA_&COUNTIF(B$1:B7,B7),IF(AND(B7=LB_DTAHAN,COUNTIF(B$1:B7,B7)<O.O1),LBD_0&COUNTIF(B$1:B7,B7),IF(AND(B7=LB_DTAHAN,COUNTIF(B$1:B7,B7)>O.O1),LBD_&COUNTIF(B$1:B7,B7),TEXT))))))))))))","v":"KAS"},"KAS","AKTIVA",null,null,"Kas & Setara Kas",null,540521097,844562963,1244562963]
[{"$f":"IF(B8=BLK,TEXT,IF(B8=KAS,B8,IF(B8=LB_BERSIH,LBS,IF(B8=PENYU,PNY,IF(AND(B8=OPERA,COUNTIF(B$1:B8,B8)<O.O1),OPR_0&COUNTIF(B$1:B8,B8),IF(AND(B8=OPERA,COUNTIF(B$1:B8,B8)>O.O1),OPR_&COUNTIF(B$1:B8,B8),IF(AND(B8=INVES,COUNTIF(B$1:B8,B8)<O.O1),INV_0&COUNTIF(B$1:B8,B8),IF(AND(B8=INVES,COUNTIF(B$1:B8,B8)>O.O1),INV_&COUNTIF(B$1:B8,B8),IF(AND(B8=PENDA,COUNTIF(B$1:B8,B8)<O.O1),DNA_0&COUNTIF(B$1:B8,B8),IF(AND(B8=PENDA,COUNTIF(B$1:B8,B8)>O.O1),DNA_&COUNTIF(B$1:B8,B8),IF(AND(B8=LB_DTAHAN,COUNTIF(B$1:B8,B8)<O.O1),LBD_0&COUNTIF(B$1:B8,B8),IF(AND(B8=LB_DTAHAN,COUNTIF(B$1:B8,B8)>O.O1),LBD_&COUNTIF(B$1:B8,B8),TEXT))))))))))))","v":"OPR-01"},"OPERASIONAL","AKTIVA",null,null,"Piutang Usaha",null,2315402899,2386402450,2585402450]
[{"$f":"IF(B9=BLK,TEXT,IF(B9=KAS,B9,IF(B9=LB_BERSIH,LBS,IF(B9=PENYU,PNY,IF(AND(B9=OPERA,COUNTIF(B$1:B9,B9)<O.O1),OPR_0&COUNTIF(B$1:B9,B9),IF(AND(B9=OPERA,COUNTIF(B$1:B9,B9)>O.O1),OPR_&COUNTIF(B$1:B9,B9),IF(AND(B9=INVES,COUNTIF(B$1:B9,B9)<O.O1),INV_0&COUNTIF(B$1:B9,B9),IF(AND(B9=INVES,COUNTIF(B$1:B9,B9)>O.O1),INV_&COUNTIF(B$1:B9,B9),IF(AND(B9=PENDA,COUNTIF(B$1:B9,B9)<O.O1),DNA_0&COUNTIF(B$1:B9,B9),IF(AND(B9=PENDA,COUNTIF(B$1:B9,B9)>O.O1),DNA_&COUNTIF(B$1:B9,B9),IF(AND(B9=LB_DTAHAN,COUNTIF(B$1:B9,B9)<O.O1),LBD_0&COUNTIF(B$1:B9,B9),IF(AND(B9=LB_DTAHAN,COUNTIF(B$1:B9,B9)>O.O1),LBD_&COUNTIF(B$1:B9,B9),TEXT))))))))))))","v":"OPR-02"},"OPERASIONAL","AKTIVA",null,null,"Piutang Lain-lain",null,92500650,51875000,101875000]
[{"$f":"IF(B10=BLK,TEXT,IF(B10=KAS,B10,IF(B10=LB_BERSIH,LBS,IF(B10=PENYU,PNY,IF(AND(B10=OPERA,COUNTIF(B$1:B10,B10)<O.O1),OPR_0&COUNTIF(B$1:B10,B10),IF(AND(B10=OPERA,COUNTIF(B$1:B10,B10)>O.O1),OPR_&COUNTIF(B$1:B10,B10),IF(AND(B10=INVES,COUNTIF(B$1:B10,B10)<O.O1),INV_0&COUNTIF(B$1:B10,B10),IF(AND(B10=INVES,COUNTIF(B$1:B10,B10)>O.O1),INV_&COUNTIF(B$1:B10,B10),IF(AND(B10=PENDA,COUNTIF(B$1:B10,B10)<O.O1),DNA_0&COUNTIF(B$1:B10,B10),IF(AND(B10=PENDA,COUNTIF(B$1:B10,B10)>O.O1),DNA_&COUNTIF(B$1:B10,B10),IF(AND(B10=LB_DTAHAN,COUNTIF(B$1:B10,B10)<O.O1),LBD_0&COUNTIF(B$1:B10,B10),IF(AND(B10=LB_DTAHAN,COUNTIF(B$1:B10,B10)>O.O1),LBD_&COUNTIF(B$1:B10,B10),TEXT))))))))))))","v":"OPR-03"},"OPERASIONAL","AKTIVA",null,null,"Persediaan",null,3507429049,3366894009,3766894009]
[{"$f":"IF(B11=BLK,TEXT,IF(B11=KAS,B11,IF(B11=LB_BERSIH,LBS,IF(B11=PENYU,PNY,IF(AND(B11=OPERA,COUNTIF(B$1:B11,B11)<O.O1),OPR_0&COUNTIF(B$1:B11,B11),IF(AND(B11=OPERA,COUNTIF(B$1:B11,B11)>O.O1),OPR_&COUNTIF(B$1:B11,B11),IF(AND(B11=INVES,COUNTIF(B$1:B11,B11)<O.O1),INV_0&COUNTIF(B$1:B11,B11),IF(AND(B11=INVES,COUNTIF(B$1:B11,B11)>O.O1),INV_&COUNTIF(B$1:B11,B11),IF(AND(B11=PENDA,COUNTIF(B$1:B11,B11)<O.O1),DNA_0&COUNTIF(B$1:B11,B11),IF(AND(B11=PENDA,COUNTIF(B$1:B11,B11)>O.O1),DNA_&COUNTIF(B$1:B11,B11),IF(AND(B11=LB_DTAHAN,COUNTIF(B$1:B11,B11)<O.O1),LBD_0&COUNTIF(B$1:B11,B11),IF(AND(B11=LB_DTAHAN,COUNTIF(B$1:B11,B11)>O.O1),LBD_&COUNTIF(B$1:B11,B11),TEXT))))))))))))","v":"OPR-04"},"OPERASIONAL","AKTIVA",null,null,"Uang Muka Biaya",null,467090919.52908325,607737515,607737515]
[{"$f":"IF(B12=BLK,TEXT,IF(B12=KAS,B12,IF(B12=LB_BERSIH,LBS,IF(B12=PENYU,PNY,IF(AND(B12=OPERA,COUNTIF(B$1:B12,B12)<O.O1),OPR_0&COUNTIF(B$1:B12,B12),IF(AND(B12=OPERA,COUNTIF(B$1:B12,B12)>O.O1),OPR_&COUNTIF(B$1:B12,B12),IF(AND(B12=INVES,COUNTIF(B$1:B12,B12)<O.O1),INV_0&COUNTIF(B$1:B12,B12),IF(AND(B12=INVES,COUNTIF(B$1:B12,B12)>O.O1),INV_&COUNTIF(B$1:B12,B12),IF(AND(B12=PENDA,COUNTIF(B$1:B12,B12)<O.O1),DNA_0&COUNTIF(B$1:B12,B12),IF(AND(B12=PENDA,COUNTIF(B$1:B12,B12)>O.O1),DNA_&COUNTIF(B$1:B12,B12),IF(AND(B12=LB_DTAHAN,COUNTIF(B$1:B12,B12)<O.O1),LBD_0&COUNTIF(B$1:B12,B12),IF(AND(B12=LB_DTAHAN,COUNTIF(B$1:B12,B12)>O.O1),LBD_&COUNTIF(B$1:B12,B12),TEXT))))))))))))","v":"OPR-05"},"OPERASIONAL","AKTIVA",null,null,"Uang Muka Pajak",null,288637883,196506707,196506707]
[{"$f":"IF(B13=BLK,TEXT,IF(B13=KAS,B13,IF(B13=LB_BERSIH,LBS,IF(B13=PENYU,PNY,IF(AND(B13=OPERA,COUNTIF(B$1:B13,B13)<O.O1),OPR_0&COUNTIF(B$1:B13,B13),IF(AND(B13=OPERA,COUNTIF(B$1:B13,B13)>O.O1),OPR_&COUNTIF(B$1:B13,B13),IF(AND(B13=INVES,COUNTIF(B$1:B13,B13)<O.O1),INV_0&COUNTIF(B$1:B13,B13),IF(AND(B13=INVES,COUNTIF(B$1:B13,B13)>O.O1),INV_&COUNTIF(B$1:B13,B13),IF(AND(B13=PENDA,COUNTIF(B$1:B13,B13)<O.O1),DNA_0&COUNTIF(B$1:B13,B13),IF(AND(B13=PENDA,COUNTIF(B$1:B13,B13)>O.O1),DNA_&COUNTIF(B$1:B13,B13),IF(AND(B13=LB_DTAHAN,COUNTIF(B$1:B13,B13)<O.O1),LBD_0&COUNTIF(B$1:B13,B13),IF(AND(B13=LB_DTAHAN,COUNTIF(B$1:B13,B13)>O.O1),LBD_&COUNTIF(B$1:B13,B13),TEXT))))))))))))","v":"-"},null,null,null,null,"ASET TETAP"]
[{"$f":"IF(B14=BLK,TEXT,IF(B14=KAS,B14,IF(B14=LB_BERSIH,LBS,IF(B14=PENYU,PNY,IF(AND(B14=OPERA,COUNTIF(B$1:B14,B14)<O.O1),OPR_0&COUNTIF(B$1:B14,B14),IF(AND(B14=OPERA,COUNTIF(B$1:B14,B14)>O.O1),OPR_&COUNTIF(B$1:B14,B14),IF(AND(B14=INVES,COUNTIF(B$1:B14,B14)<O.O1),INV_0&COUNTIF(B$1:B14,B14),IF(AND(B14=INVES,COUNTIF(B$1:B14,B14)>O.O1),INV_&COUNTIF(B$1:B14,B14),IF(AND(B14=PENDA,COUNTIF(B$1:B14,B14)<O.O1),DNA_0&COUNTIF(B$1:B14,B14),IF(AND(B14=PENDA,COUNTIF(B$1:B14,B14)>O.O1),DNA_&COUNTIF(B$1:B14,B14),IF(AND(B14=LB_DTAHAN,COUNTIF(B$1:B14,B14)<O.O1),LBD_0&COUNTIF(B$1:B14,B14),IF(AND(B14=LB_DTAHAN,COUNTIF(B$1:B14,B14)>O.O1),LBD_&COUNTIF(B$1:B14,B14),TEXT))))))))))))","v":"INV-01"},"INVESTASI","AKTIVA",null,null,"Perolehan Aktiva Tetap",null,35668384715,35668384715.300003,35668384715.300003]
[{"$f":"IF(B15=BLK,TEXT,IF(B15=KAS,B15,IF(B15=LB_BERSIH,LBS,IF(B15=PENYU,PNY,IF(AND(B15=OPERA,COUNTIF(B$1:B15,B15)<O.O1),OPR_0&COUNTIF(B$1:B15,B15),IF(AND(B15=OPERA,COUNTIF(B$1:B15,B15)>O.O1),OPR_&COUNTIF(B$1:B15,B15),IF(AND(B15=INVES,COUNTIF(B$1:B15,B15)<O.O1),INV_0&COUNTIF(B$1:B15,B15),IF(AND(B15=INVES,COUNTIF(B$1:B15,B15)>O.O1),INV_&COUNTIF(B$1:B15,B15),IF(AND(B15=PENDA,COUNTIF(B$1:B15,B15)<O.O1),DNA_0&COUNTIF(B$1:B15,B15),IF(AND(B15=PENDA,COUNTIF(B$1:B15,B15)>O.O1),DNA_&COUNTIF(B$1:B15,B15),IF(AND(B15=LB_DTAHAN,COUNTIF(B$1:B15,B15)<O.O1),LBD_0&COUNTIF(B$1:B15,B15),IF(AND(B15=LB_DTAHAN,COUNTIF(B$1:B15,B15)>O.O1),LBD_&COUNTIF(B$1:B15,B15),TEXT))))))))))))","v":"PNY"},"PENYUSUTAN","AKTIVA",null,null,"Akumulasi Penyusutan",null,-4425710157,-4528660434,-4631610711]
{"$rows_left_out":59}
{"sheet":"Arus Kas","index":3,"n_rows":58,"n_cols":28,"rows_kept":58,"cut":false,"hidden":false,"merged":[[4,0,5,1],[57,27,57,28],[57,14,57,15]]}
[]
[]
[null,null,null,null,{"$f":"Perusahaan","v":"PT. EXPRESS GEMBOL"},null,null,null,null,null,null,null,null,null,null,null,null,{"$f":"Perusahaan","v":"PT. EXPRESS GEMBOL"}]
[null,null,null,null,"LAPORAN ARUS KAS (TIDAK LANGSUNG)",null,null,null,null,null,null,null,null,null,null,null,null,"LAPORAN ARUS KAS (TIDAK LANGSUNG)"]
["KODE",null,null,null,{"$f":"Periode_1","v":"Periode 31-Des-2015 s/d 31-Des-2016"},null,null,null,null,null,null,null,null,null,null,null,null,{"$f":"Periode_2","v":"Periode 31-Des-2016 s/d 31-Des-2017"}]
[]
[]
[null,null,null,null,"1.","KENAIKAN / PENURUNAN KAS DARI AKTIVITAS OPERASIONAL",null,null,null,null,null,null,null,null,null,null,null,"1.","KENAIKAN / PENURUNAN KAS DARI AKTIVITAS OPERASIONAL"]
[null,null,null,null,null,null,"Laba (Rugi) Bersih",null,null,null,null,null,null,null,null,null,null,null,null,"Laba (Rugi) Bersih"]
["LBS",null,null,null,null,null,"-",{"$f":"IF(ISNA(VLOOKUP($A10,data,O.3,FALSE)),TEXT,VLOOKUP($A10,data,O.3,FALSE))","v":"Laba Bersih Setelah Pajak"},null,null,null,null,null,null,{"$f":"ERROR+IF(VLOOKUP($A10,data,O.1,FALSE)=LABA_2,SUMIF(data_0,$A10,data_2),IF(VLOOKUP($A10,data,O.1,FALSE)=KAS,SUMIF(data_0,$A10,data_1),IF(VLOOKUP($A10,data,O.1,FALSE)=LABA_1,SUMIF(data_0,$A10,data_2)-SUMIF(data_0,$A10,data_1)-SUMIF(data_0,$B10,data_1),IF(VLOOKUP($A10,data,O.2,FALSE)=AKT,SUMIF(data_0,$A10,data_1)-SUMIF(data_0,$A10,data_2),IF(VLOOKUP($A10,data,O.2,FALSE)=PSV,SUMIF(data_0,$A10,data_2)-SUMIF(data_0,$A10,data_1),ERROR)))))","v":1245340554.3155999},null,null,null,null,"-",{"$f":"IF(ISNA(VLOOKUP($A10,data,O.3,FALSE)),TEXT,VLOOKUP($A10,data,O.3,FALSE))","v":"Laba Bersih Setelah Pajak"},null,null,null,null,null,null,{"$f":"ERROR+IF(VLOOKUP($A10,data,O.1,FALSE)=LABA_2,SUMIF(data_0,$A10,data_3),IF(VLOOKUP($A10,data,O.1,FALSE)=KAS,SUMIF(data_0,$A10,data_2),IF(VLOOKUP($A10,data,O.1,FALSE)=LABA_1,SUMIF(data_0,$A10,data_3)-SUMIF(data_0,$A10,data_2)-SUMIF(data_0,$B10,data_2),IF(VLOOKUP($A10,data,O.2,FALSE)=AKT,SUMIF(data_0,$A10,data_2)-SUMIF(data_0,$A10,data_3),IF(VLOOKUP($A10,data,O.2,FALSE)=PSV,SUMIF(data_0,$A10,data_3)-SUMIF(data_0,$A10,data_2),ERROR)))))","v":1715240554.3155999}]
["PNY",null,null,null,null,null,"-",{"$f":"IF(ISNA(VLOOKUP($A11,data,O.3,FALSE)),TEXT,VLOOKUP($A11,data,O.3,FALSE))","v":"Akumulasi Penyusutan"},null,null,null,null,null,null,{"$f":"ERROR+IF(VLOOKUP($A11,data,O.1,FALSE)=LABA_2,SUMIF(data_0,$A11,data_2),IF(VLOOKUP($A11,data,O.1,FALSE)=KAS,SUMIF(data_0,$A11,data_1),IF(VLOOKUP($A11,data,O.1,FALSE)=LABA_1,SUMIF(data_0,$A11,data_2)-SUMIF(data_0,$A11,data_1)-SUMIF(data_0,$B11,data_1),IF(VLOOKUP($A11,data,O.2,FALSE)=AKT,SUMIF(data_0,$A11,data_1)-SUMIF(data_0,$A11,data_2),IF(VLOOKUP($A11,data,O.2,FALSE)=PSV,SUMIF(data_0,$A11,data_2)-SUMIF(data_0,$A11,data_1),ERROR)))))","v":102950277},null,null,null,null,"-",{"$f":"IF(ISNA(VLOOKUP($A11,data,O.3,FALSE)),TEXT,VLOOKUP($A11,data,O.3,FALSE))","v":"Akumulasi Penyusutan"},null,null,null,null,null,null,{"$f":"ERROR+IF(VLOOKUP($A11,data,O.1,FALSE)=LABA_2,SUMIF(data_0,$A11,data_3),IF(VLOOKUP($A11,data,O.1,FALSE)=KAS,SUMIF(data_0,$A11,data_2),IF(VLOOKUP($A11,data,O.1,FALSE)=LABA_1,SUMIF(data_0,$A11,data_3)-SUMIF(data_0,$A11,data_2)-SUMIF(data_0,$B11,data_2),IF(VLOOKUP($A11,data,O.2,FALSE)=AKT,SUMIF(data_0,$A11,data_2)-SUMIF(data_0,$A11,data_3),IF(VLOOKUP($A11,data,O.2,FALSE)=PSV,SUMIF(data_0,$A11,data_3)-SUMIF(data_0,$A11,data_2),ERROR)))))","v":102950277}]
[null,null,null,null,null,null,null,"Laba Bersih Koreksi Tanpa Penyusutan",null,null,null,null,null,null,{"$f":"SUM(O10:O11)","v":1348290831.3155999},null,null,null,null,null,"Laba Bersih Koreksi Tanpa Penyusutan",null,null,null,null,null,null,{"$f":"SUM(AB10:AB11)","v":1818190831.3155999}]
[null,null,null,null,null,null,"Kenaikan / Penurunan Pos-pos Aset Lancar dan Hutang Lancar",null,null,null,null,null,null,null,null,null,null,null,null,"Kenaikan / Penurunan Pos-pos Aset Lancar dan Hutang Lancar"]
["OPR-01",null,null,null,null,null,"-",{"$f":"IF(ISNA(VLOOKUP($A14,data,O.3,FALSE)),TEXT,VLOOKUP($A14,data,O.3,FALSE))","v":"Piutang Usaha"},null,null,null,null,null,{"$f":"IF(AND(VLOOKUP($A14,data,O.2,FALSE)=AKT,$O14<ERROR),NAIK,IF(AND(VLOOKUP($A14,data,O.2,FALSE)=AKT,$O14>ERROR),TURUN,IF(AND(VLOOKUP($A14,data,O.2,FALSE)=PSV,$O14>ERROR),NAIK,IF(AND(VLOOKUP($A14,data,O.2,FALSE)=PSV,$O14<ERROR),TURUN,TEXT))))","v":"Naik"},{"$f":"ERROR+IF(VLOOKUP($A14,data,O.1,FALSE)=LABA_2,SUMIF(data_0,$A14,data_2),IF(VLOOKUP($A14,data,O.1,FALSE)=KAS,SUMIF(data_0,$A14,data_1),IF(VLOOKUP($A14,data,O.1,FALSE)=LABA_1,SUMIF(data_0,$A14,data_2)-SUMIF(data_0,$A14,data_1)-SUMIF(data_0,$B14,data_1),IF(VLOOKUP($A14,data,O.2,FALSE)=AKT,SUMIF(data_0,$A14,data_1)-SUMIF(data_0,$A14,data_2),IF(VLOOKUP($A14,data,O.2,FALSE)=PSV,SUMIF(data_0,$A14,data_2)-SUMIF(data_0,$A14,data_1),ERROR)))))","v":-70999551},null,null,null,null,"-",{"$f":"IF(ISNA(VLOOKUP($A14,data,O.3,FALSE)),TEXT,VLOOKUP($A14,data,O.3,FALSE))","v":"Piutang Usaha"},null,null,null,null,null,{"$f":"IF(AND(VLOOKUP($A14,data,O.2,FALSE)=AKT,$O14<ERROR),NAIK,IF(AND(VLOOKUP($A14,data,O.2,FALSE)=AKT,$O14>ERROR),TURUN,IF(AND(VLOOKUP($A14,data,O.2,FALSE)=PSV,$O14>ERROR),NAIK,IF(AND(VLOOKUP($A14,data,O.2,FALSE)=PSV,$O14<ERROR),TURUN,TEXT))))","v":"Naik"},{"$f":"ERROR+IF(VLOOKUP($A14,data,O.1,FALSE)=LABA_2,SUMIF(data_0,$A14,data_3),IF(VLOOKUP($A14,data,O.1,FALSE)=KAS,SUMIF(data_0,$A14,data_2),IF(VLOOKUP($A14,data,O.1,FALSE)=LABA_1,SUMIF(data_0,$A14,data_3)-SUMIF(data_0,$A14,data_2)-SUMIF(data_0,$B14,data_2),IF(VLOOKUP($A14,data,O.2,FALSE)=AKT,SUMIF(data_0,$A14,data_2)-SUMIF(data_0,$A14,data_3),IF(VLOOKUP($A14,data,O.2,FALSE)=PSV,SUMIF(data_0,$A14,data_3)-SUMIF(data_0,$A14,data_2),ERROR)))))","v":-199000000}]
["OPR-02",null,null,null,null,null,"-","Piutang Lain-lain",null,null,null,null,null,"Turun",40625650,null,null,null,null,"-","Piutang Lain-lain",null,null,null,null,null,"Turun",-50000000]
{"$rows_left_out":44}
{"sheet":"HD","index":4,"n_rows":6000,"n_cols":650,"rows_kept":6000,"cut":false,"hidden":true,"merged":[]}
[]
[null,"info"]
[]
[]
[]
[]
[]
[]
[]
[]
[]
[]
[]
[]
[]
{"$rows_left_out":5985}