{"text_format":"1","workbook":"xlsx","n_sheets":7,"sheets":["ID","Reg","Menu","Ringkasan","Tabel Penyusutan","Ketentuan UU","HD"],"not_rendered":{"charts":0,"images":2,"macros":1,"external_links":0,"defined_names":46,"comments":0,"pivot_tables":0},"unopened":[],"bounds":{"document_bytes":16777216,"sheet_cells":100000,"rows_first":2000,"rows_last":500,"rows_between":2000,"halvings":0,"cell_chars":16384,"cell_head_chars":4096},"cells_cut":0,"cells_raw":0,"read":"whole","date_system":"1900"}

{"sheet":"ID","index":0,"n_rows":500,"n_cols":154,"rows_kept":500,"cut":false,"hidden":true,"merged":[]}
[null,null,null,null,null,null,null,null,null,null,null,null,null,null,null,null,null,null,null,null,null,null,null,null,null,null,null,null,null,null,null,null,null,null,null,null,null,null,null,null,null,null,null,null,null,null,null,null,null,null,null,null,null,null,null,null,null,null,null,null,null,null,null,null,null,null,null,null,null,null,null,null,null,null,null,null,null,null,null,null,null,null,null,null,null,null,null,null,null,null,null,null,null,null,null,null,null,null,null,null,null,null,null,null,null,null,null,null,null,null,null,null,null,null,null,null,null,null,null,null,null,null,null,null,null,null,null,null,null,null,null,null,null,null,null,null,null,null,null,null,null,null,null,null,null,null,null,null,null,null,null,null,null,{"$f":"IF(INDEX(Ringkasan!C:C,0,1)=0,\"-\",INDEX(Ringkasan!C:C,0,1))","v":"-"}]
[null,null,null,null,null,null,null,null,null,null,null,null,null,null,null,null,null,null,null,null,null,null,null,null,null,null,null,null,null,null,null,null,null,null,null,null,null,null,null,null,null,null,null,null,null,null,null,null,null,null,{"$f":"IF(AND(Reg!D6=REG,Menu!E6=\"PT. BENGKOANG\",Menu!E9>2014,Menu!E9<2020,MIN('Tabel Penyusutan'!I7:I55)>2014,MAX('Tabel Penyusutan'!I7:I55)<2020),Menu!E6,\"#\")","v":"PT. BENGKOANG"},null,null,null,null,null,null,null,null,null,null,null,null,null,null,null,null,null,null,null,null,null,null,null,null,null,null,null,null,null,null,null,null,null,null,null,null,null,null,null,null,null,null,null,null,null,null,null,null,null,null,"Bulan","Index",null,null,null,null,null,null,null,null,null,null,null,null,null,null,null,null,null,null,null,null,null,null,null,null,null,null,null,null,null,null,null,null,null,null,null,null,null,null,null,null,null,null,null,null,null,null,null,null,null,null,{"$f":"IF(INDEX(Ringkasan!C:C,0,1)=0,\"-\",INDEX(Ringkasan!C:C,0,1))","v":"-"}]
[null,null,null,null,null,null,null,null,null,null,null,null,null,null,null,null,null,null,null,null,null,null,null,null,null,null,null,null,null,null,null,null,null,null,null,null,null,null,null,null,null,null,null,null,null,null,null,null,null,null,{"$f":"IF(No=O_,Nm,\"#\")","v":"PT. BENGKOANG"},null,null,null,null,null,null,null,null,null,null,null,null,null,null,null,null,null,null,null,null,null,null,null,null,null,null,null,null,null,null,null,null,null,null,null,null,null,null,null,null,null,null,null,null,null,null,null,null,null,null,"Januari",1,null,null,null,null,null,null,null,null,null,null,null,null,null,null,null,null,null,null,null,null,null,null,null,null,null,null,null,null,null,null,null,null,null,null,null,null,null,null,null,null,null,null,null,null,null,null,null,null,null,null,{"$f":"IF(INDEX(Ringkasan!C:C,0,1)=0,\"-\",INDEX(Ringkasan!C:C,0,1))","v":"-"}]
[null,null,null,null,null,null,null,null,null,null,null,null,null,null,null,null,null,null,null,null,null,null,null,null,null,null,null,null,null,null,null,null,null,null,null,null,null,null,null,null,null,null,null,null,null,null,null,null,null,null,null,null,null,null,null,null,null,null,null,null,null,null,null,null,null,null,null,null,null,null,null,null,null,null,null,null,null,null,null,null,null,null,null,null,null,null,null,null,null,null,null,null,null,null,null,null,null,null,null,null,null,"Februari",2,null,null,null,null,null,null,null,null,null,null,null,null,null,null,null,null,null,null,null,null,null,null,null,null,null,null,null,null,null,null,null,null,null,null,null,null,null,null,null,null,null,null,null,null,null,null,null,null,null,null,{"$f":"IF(INDEX(Ringkasan!C:C,0,1)=0,\"-\",INDEX(Ringkasan!C:C,0,1))","v":"-"}]
[null,null,null,null,null,null,null,null,null,null,null,null,null,null,null,null,null,null,null,null,null,null,null,null,null,null,null,null,null,null,null,null,null,null,null,null,null,null,null,null,null,null,null,null,null,null,null,null,null,null,{"$f":"IF(AND(Reg!D6=REG,Menu!E6=\"PT. BENGKOANG\",Menu!E9>2014,Menu!E9<2020,MIN('Tabel Penyusutan'!I7:I55)>2014,MAX('Tabel Penyusutan'!I7:I55)<2020),HD!XY2000+HD!XY3000+HD!XY4000+O_,\"#\")","v":0},null,null,null,null,null,null,null,null,null,null,null,null,null,null,null,null,null,null,null,null,null,null,null,null,null,null,null,null,null,null,null,null,null,null,null,null,null,null,null,null,null,null,null,null,null,null,null,null,null,null,"Maret",3,null,null,null,null,null,null,null,null,null,null,null,null,null,null,null,null,null,null,null,null,null,null,null,null,null,null,null,null,null,null,null,null,null,null,null,null,null,null,null,null,null,null,null,null,null,null,null,null,null,null,{"$f":"IF(INDEX(Ringkasan!C:C,0,1)=0,\"-\",INDEX(Ringkasan!C:C,0,1))","v":"-"}]
[null,null,null,null,null,null,null,null,null,null,null,null,null,null,null,null,null,null,null,null,null,null,null,null,null,null,null,null,null,null,null,null,null,null,null,null,null,null,null,null,null,null,null,null,null,null,null,null,null,null,{"$f":"IF(AND(Reg!D6=REG,Menu!E6=\"PT. BENGKOANG\",Menu!E9>2014,Menu!E9<2020,MIN('Tabel Penyusutan'!I7:I55)>2014,MAX('Tabel Penyusutan'!I7:I55)<2020),HD!XY2000+HD!XY3000+HD!XY4000+O_,\"#\")","v":0},null,null,null,null,null,null,null,null,null,null,null,null,null,null,null,null,null,null,null,null,null,null,null,null,null,null,null,null,null,null,null,null,null,null,null,null,null,null,null,null,null,null,null,null,null,null,null,null,null,null,"April",4,null,null,null,null,null,null,null,null,null,null,null,null,null,null,null,null,null,null,null,null,null,null,null,null,null,null,null,null,null,null,null,null,null,null,null,null,null,null,null,null,null,null,null,null,null,null,null,null,null,null,{"$f":"IF(INDEX(Ringkasan!C:C,0,1)=0,\"-\",INDEX(Ringkasan!C:C,0,1))","v":"Kelompok Aset Tetap"}]
[null,null,null,null,null,null,null,null,null,null,null,null,null,null,null,null,null,null,null,null,null,null,null,null,null,null,null,null,null,null,null,null,null,null,null,null,null,null,null,null,null,null,null,null,null,null,null,null,null,null,null,null,null,null,null,null,null,null,null,null,null,null,null,null,null,null,null,null,null,null,null,null,null,null,null,null,null,null,null,null,null,null,null,null,null,null,null,null,null,null,null,null,null,null,null,null,null,null,null,null,null,"Mei",5,null,null,null,null,null,null,null,null,null,null,null,null,null,null,null,null,null,null,null,null,null,null,null,null,null,null,null,null,null,null,null,null,null,null,null,null,null,null,null,null,null,null,null,null,null,null,null,null,null,null,{"$f":"IF(INDEX(Ringkasan!C:C,0,1)=0,\"-\",INDEX(Ringkasan!C:C,0,1))","v":"-"}]
[null,null,null,null,null,null,null,null,null,null,null,null,null,null,null,null,null,null,null,null,null,null,null,null,null,null,null,null,null,null,null,null,null,null,null,null,null,null,null,null,null,null,null,null,null,null,null,null,null,null,null,null,null,null,null,null,null,null,null,null,null,null,null,null,null,null,null,null,null,null,null,null,null,null,null,null,null,null,null,null,null,null,null,null,null,null,null,null,null,null,null,null,null,null,null,null,null,null,null,null,null,"Juni",6,null,null,null,null,null,null,null,null,null,null,null,null,null,null,null,null,null,null,null,null,null,null,null,null,null,null,null,null,null,null,null,null,null,null,null,null,null,null,null,null,null,null,null,null,null,null,null,null,null,null,{"$f":"IF(INDEX(Ringkasan!C:C,0,1)=0,\"-\",INDEX(Ringkasan!C:C,0,1))","v":"Tanah"}]
[null,null,null,null,null,null,null,null,null,null,null,null,null,null,null,null,null,null,null,null,null,null,null,null,null,null,null,null,null,null,null,null,null,null,null,null,null,null,null,null,null,null,null,null,null,null,null,null,null,null,null,null,null,null,null,null,null,null,null,null,null,null,null,null,null,null,null,null,null,null,null,null,null,null,null,null,null,null,null,null,null,null,null,null,null,null,null,null,null,null,null,null,null,null,null,null,null,null,null,null,null,"Juli",7,null,null,null,null,null,null,null,null,null,null,null,null,null,null,null,null,null,null,null,null,null,null,null,null,null,null,null,null,null,null,null,null,null,null,null,null,null,null,null,null,null,null,null,null,null,null,null,null,null,null,{"$f":"IF(INDEX(Ringkasan!C:C,0,1)=0,\"-\",INDEX(Ringkasan!C:C,0,1))","v":"Bangunan"}]
[null,null,null,null,null,null,null,null,null,null,null,null,null,null,null,null,null,null,null,null,null,null,null,null,null,null,null,null,null,null,null,null,null,null,null,null,null,null,null,null,null,null,null,null,null,null,null,null,null,null,null,null,null,null,null,null,null,null,null,null,null,null,null,null,null,null,null,null,null,null,null,null,null,null,null,null,null,null,null,null,null,null,null,null,null,null,null,null,null,null,null,null,null,null,null,null,null,null,null,null,null,"Agustus",8,null,null,null,null,null,null,null,null,null,null,null,null,null,null,null,null,null,null,null,null,null,null,null,null,null,null,null,null,null,null,null,null,null,null,null,null,null,null,null,null,null,null,null,null,null,null,null,null,null,null,{"$f":"IF(INDEX(Ringkasan!C:C,0,1)=0,\"-\",INDEX(Ringkasan!C:C,0,1))","v":"Mesin"}]
[null,null,null,null,null,null,null,null,null,null,null,null,null,null,null,null,null,null,null,null,null,null,null,null,null,null,null,null,null,null,null,null,null,null,null,null,null,null,null,null,null,null,null,null,null,null,null,null,null,null,null,null,null,null,null,null,null,null,null,null,null,null,null,null,null,null,null,null,null,null,null,null,null,null,null,null,null,null,null,null,null,null,null,null,null,null,null,null,null,null,null,null,null,null,null,null,null,null,null,null,null,"September",9,null,null,null,null,null,null,null,null,null,null,null,null,null,null,null,null,null,null,null,null,null,null,null,null,null,null,null,null,null,null,null,null,null,null,null,null,null,null,null,null,null,null,null,null,null,null,null,null,null,null,{"$f":"IF(INDEX(Ringkasan!C:C,0,1)=0,\"-\",INDEX(Ringkasan!C:C,0,1))","v":"Kendaraan"}]
[null,null,null,null,null,null,null,null,null,null,null,null,null,null,null,null,null,null,null,null,null,null,null,null,null,null,null,null,null,null,null,null,null,null,null,null,null,null,null,null,null,null,null,null,null,null,null,null,null,null,null,null,null,null,null,null,null,null,null,null,null,null,null,null,null,null,null,null,null,null,null,null,null,null,null,null,null,null,null,null,null,null,null,null,null,null,null,null,null,null,null,null,null,null,null,null,null,null,null,null,null,"Oktober",10,null,null,null,null,null,null,null,null,null,null,null,null,null,null,null,null,null,null,null,null,null,null,null,null,null,null,null,null,null,null,null,null,null,null,null,null,null,null,null,null,null,null,null,null,null,null,null,null,null,null,{"$f":"IF(INDEX(Ringkasan!C:C,0,1)=0,\"-\",INDEX(Ringkasan!C:C,0,1))","v":"Peralatan Kantor"}]
[null,null,null,null,null,null,null,null,null,null,null,null,null,null,null,null,null,null,null,null,null,null,null,null,null,null,null,null,null,null,null,null,null,null,null,null,null,null,null,null,null,null,null,null,null,null,null,null,null,null,null,null,null,null,null,null,null,null,null,null,null,null,null,null,null,null,null,null,null,null,null,null,null,null,null,null,null,null,null,null,null,null,null,null,null,null,null,null,null,null,null,null,null,null,null,null,null,null,null,null,null,"November",11,null,null,null,null,null,null,null,null,null,null,null,null,null,null,null,null,null,null,null,null,null,null,null,null,null,null,null,null,null,null,null,null,null,null,null,null,null,null,null,null,null,null,null,null,null,null,null,null,null,null,{"$f":"IF(INDEX(Ringkasan!C:C,0,1)=0,\"-\",INDEX(Ringkasan!C:C,0,1))","v":"-"}]
[null,null,null,null,null,null,null,null,null,null,null,null,null,null,null,null,null,null,null,null,null,null,null,null,null,null,null,null,null,null,null,null,null,null,null,null,null,null,null,null,null,null,null,null,null,null,null,null,null,null,null,null,null,null,null,null,null,null,null,null,null,null,null,null,null,null,null,null,null,null,null,null,null,null,null,null,null,null,null,null,null,null,null,null,null,null,null,null,null,null,null,null,null,null,null,null,null,null,null,null,null,"Desember",12,null,null,null,null,null,null,null,null,null,null,null,null,null,null,null,null,null,null,null,null,null,null,null,null,null,null,null,null,null,null,null,null,null,null,null,null,null,null,null,null,null,null,null,null,null,null,null,null,null,null,{"$f":"IF(INDEX(Ringkasan!C:C,0,1)=0,\"-\",INDEX(Ringkasan!C:C,0,1))","v":"-"}]
[null,null,null,null,null,null,null,null,null,null,null,null,null,null,null,null,null,null,null,null,null,null,null,null,null,null,null,null,null,null,null,null,null,null,null,null,null,null,null,null,null,null,null,null,null,null,null,null,null,null,null,null,null,null,null,null,null,null,null,null,null,null,null,null,null,null,null,null,null,null,null,null,null,null,null,null,null,null,null,null,null,null,null,null,null,null,null,null,null,null,null,null,null,null,null,null,null,null,null,null,null,null,null,null,null,null,null,null,null,null,null,null,null,null,null,null,null,null,null,null,null,null,null,null,null,null,null,null,null,null,null,null,null,null,null,null,null,null,null,null,null,null,null,null,null,null,null,null,null,null,null,null,null,{"$f":"IF(INDEX(Ringkasan!C:C,0,1)=0,\"-\",INDEX(Ringkasan!C:C,0,1))","v":"-"}]
{"$rows_left_out":486}
{"sheet":"Reg","index":1,"n_rows":9,"n_cols":6,"rows_kept":9,"cut":false,"hidden":false,"merged":[]}
["  ","  ","  ","  ","  ","  "]
["  ","  ","  ","  ","  ","  "]
["  ","  ","  ","  ","  ","  "]
["  ","  ","  ","  ","  ","  "]
["  ","  ","  ","  ","  ","  "]
[null,null,"USER","info@xclmedia.com"]
["  ","  ","  ","  ","  "]
["  ","  ","  ","  ","  ","  "]
["  ","  ","  ","  ","  ","  "]

{"sheet":"Menu","index":2,"n_rows":11,"n_cols":5,"rows_kept":11,"cut":false,"hidden":false,"merged":[[5,4,5,6],[7,4,7,5]]}
[]
[]
[]
[]
[]
[null,null,"Perusahaan",":","PT. BENGKOANG"]
[null,null,"Penyusutan"]
[null,null,"Bulan",":","November"]
[null,null,"Tahun",":",2016]
[]
[{"$f":"IF(REG=Reg!D6,\"Reg: \"&REG&\" - @copyright: xclmedia.com\",\"Reg: Error - @copyright: xclmedia.com\")","v":"Reg: info@xclmedia.com - @copyright: xclmedia.com"}]

{"sheet":"Ringkasan","index":3,"n_rows":21,"n_cols":10,"rows_kept":21,"cut":false,"hidden":false,"merged":[]}
[]
[null,{"$f":"Perusahaan","v":"PT. BENGKOANG"}]
[null,"RINGKASAN DAFTAR PENYUSUTAN"]
[null,{"$f":"Tanggal","v":"Bulan : November 2016"}]
[]
[null,"No","Kelompok Aset Tetap",null,"Harga Perolehan","Penyusutan","Penyusutan","Penyusutan","Total Penyusutan","Nilai Buku"]
[null,null,null,null,null,{"$f":"Bl..","v":"Nov-2016"},{"$f":"Th.","v":"s.d. Tahun 2015"},{"$f":"Th..","v":"Tahun 2016"}]
[null,{"$f":"IF(C8=No,Min,COUNTA(C$8:C8))","v":1},"Tanah",null,{"$f":"SUMIF(Klom1,IF(No=Np,C8,Bn),Klom2)","v":325000000},{"$f":"SUMIF(Klom1,IF(Bn=Bo,C8,No),Klom3)","v":0},{"$f":"SUMIF(Klom1,IF(No=Bo,C8,Bn),Klom4)","v":0},{"$f":"SUMIF(Klom1,IF(No=Bo,C8,Bn),Klom5)","v":0},{"$f":"G8+H8","v":0},{"$f":"E8-I8","v":325000000}]
[null,{"$f":"IF(C9=No,Min,COUNTA(C$8:C9))","v":2},"Bangunan",null,525000000,2187500,24687500,24062500,{"$f":"G9+H9","v":48750000},{"$f":"E9-I9","v":476250000}]
[null,{"$f":"IF(C10=No,Min,COUNTA(C$8:C10))","v":3},"Mesin",null,4470000000,23645833.333333336,233124999.99999997,260104166.66666669,493229166.66666663,3976770833.3333335]
[null,{"$f":"IF(C11=No,Min,COUNTA(C$8:C11))","v":4},"Kendaraan",null,285500000,2973958.3333333335,29239583.333333332,32713541.666666668,61953125,223546875]
[null,{"$f":"IF(C12=No,Min,COUNTA(C$8:C12))","v":5},"Peralatan Kantor",null,66050000,1376041.6666666665,16053125,15136458.333333334,31189583.333333336,34860416.666666664]
[null,{"$f":"IF(C13=No,Min,COUNTA(C$8:C13))","v":"-"},null,null,0,0,0,0,0,0]
[null,{"$f":"IF(C14=No,Min,COUNTA(C$8:C14))","v":"-"},null,null,0,0,0,0,0,0]
[null,{"$f":"IF(C15=No,Min,COUNTA(C$8:C15))","v":"-"},null,null,0,0,0,0,0,0]
{"$rows_left_out":7}
{"sheet":"Tabel Penyusutan","index":4,"n_rows":57,"n_cols":24,"rows_kept":57,"cut":false,"hidden":false,"merged":[[3,9,3,11],[3,19,3,20],[4,19,4,20],[3,4,3,8],[3,17,3,18],[4,17,4,18]]}
[null,{"$f":"Perusahaan","v":"PT. BENGKOANG"}]
[null,"DAFTAR PENYUSUTAN AKTIVA TETAP"]
[null,{"$f":"Tanggal","v":"Bulan : November 2016"}]
[null,null,null,null,"Tanggal",null,null,null,null,"Nilai",null,null,null,"Umur","Persentase","Penyusutan","Penyusutan","Akum. Peny.",null,"Penyusutan",null,"Total",null,"Keterangan Sisa"]
[null,"No","Keterangan","Kelompok","Tgl","Bulan","Tahun","Mulai","Tahun","Unit","Harga","Jumlah","Nilai Sisa","Ekonomis","Penyusutan","Per Bulan",{"$f":"Bl..","v":"Nov-2016"},{"$f":"Th.","v":"s.d. Tahun 2015"},null,{"$f":"Th..","v":"Tahun 2016"},null,"Akumulasi","Nilai Buku","Bulan / Tahun"]
[null,null,null,null,null,"Perolehan",null,"Penyusutan",null,null,"Perolehan",null,null,"(Tahun)","Per Tahun",null,null,"Bln","Jumlah","Bln","Jumlah","Penyusutan"]
[null,null,null,null,null,null,null,null,null,null,null,{"$f":"IF(Nm<>Nn,No,IF(Bl<>Bm,Bn,IF(J7<>Bn,J7*K7+Np,K7+Bo)))","v":0},null,null,{"$f":"IF(Nm<>Nn,Min,IF(Bl<>Bm,Min,IF(N7<>Bo,(1/N7)+Np,Min)))","v":"-"},{"$f":"IF(Nm<>Nn,No,IF(OR(Bl<>Bm),Bn,IF(O7=Min,No,((L7-M7-Np-Bo)*(O7/12)+Np+Bo))))","v":0},{"$f":"IF(AND(Nm=Nn,Bl=Bm),IF(H7<>Bn,IF(Bln<>Bo,IF(N7<>Bn,IF(AND(Thn=I7,VLOOKUP(Bln,ID,Scd,FALSE)>=VLOOKUP(H7,ID,Scd,FALSE)),P7,IF(AND(Thn>I7,(12-VLOOKUP(H7,ID,Scd,FALSE))+((Thn-I7)*12)-(12-VLOOKUP(Bln,ID,Scd,FALSE))<N7*12),P7,No)),Np),Bo),Bn),Bo)","v":0},{"$f":"IF(AND(Nm=Nn,Bl=Bm),IF(H7<>Bn,IF((IF(13-VLOOKUP(H7,ID,Scd,FALSE)+(Thn-I7-1)*12<=N7*12,13-Bn-VLOOKUP(H7,ID,Scd,FALSE)+Bo+(Thn-I7-1)*12,IF(AND(13-VLOOKUP(H7,ID,Scd,FALSE)+(Thn-I7-1)*12>N7*12),N7*12,Np)))<Bo,Bn,(IF(13-VLOOKUP(H7,ID,Scd,FALSE)+(Thn-I7-1)*12<=N7*12,13-VLOOKUP(H7,ID,Scd,FALSE)+(Thn-I7-1)*12,IF(13-VLOOKUP(H7,ID,Scd,FALSE)+(Thn-I7-1)*12>N7*12,N7*12,No)))),Np),Bn+Bo)","v":0},{"$f":"IF(P7=Min,No,P7*R7)","v":0},{"$f":"IF(ISNA(VLOOKUP(H7,ID,Scd,FALSE))=TRUE,No,IF(IF(N7*12=R7,Bn,IF(AND(N7*12-R7<VLOOKUP(H7,ID,Scd,FALSE),VLOOKUP(H7,ID,Scd,FALSE)<=VLOOKUP(Bln,ID,Scd,FALSE)),VLOOKUP(H7,ID,Scd,FALSE)-1,IF(AND(N7*12-R7<VLOOKUP(H7,ID,Scd,FALSE),VLOOKUP(H7,ID,Scd,FALSE)>VLOOKUP(Bln,ID,Scd,FALSE)),VLOOKUP(Bln,ID,Scd,FALSE),IF(AND(R7=Bo,I7<Thn),VLOOKUP(Bln,ID,Scd,FALSE)-1,IF(AND(R7=Bn,I7=Thn),VLOOKUP(Bln,ID,Scd,FALSE)-VLOOKUP(H7,ID,Scd,FALSE)+1,VLOOKUP(Bln,ID,Scd,FALSE))))))<Bo,Np+Bo,IF(OR(Thn<I7,H7=Bn,Bln=Bo,Nm<>Nn,Bl<>Bm),No+Bn,IF(N7*12=R7,Bn,IF(AND(N7*12-R7<VLOOKUP(H7,ID,Scd,FALSE),VLOOKUP(H7,ID,Scd,FALSE)<=VLOOKUP(Bln,ID,Scd,FALSE)),VLOOKUP(H7,ID,Scd,FALSE)-1,IF(AND(N7*12-R7<VLOOKUP(H7,ID,Scd,FALSE),VLOOKUP(H7,ID,Scd,FALSE)>VLOOKUP(Bln,ID,Scd,FALSE)),VLOOKUP(Bln,ID,Scd,FALSE),IF(AND(R7=Bo,I7<Thn),VLOOKUP(Bln,ID,Scd,FALSE)-1,IF(AND(R7=Bn,I7=Thn),VLOOKUP(Bln,ID,Scd,FALSE)-VLOOKUP(H7,ID,Scd,FALSE)+1,VLOOKUP(Bln,ID,Scd,FALSE)))))))))","v":0},{"$f":"P7*T7","v":0},{"$f":"S7+U7","v":0},{"$f":"L7-V7","v":0},{"$f":"IF(AND(Nm=Nn,Bl=Bm,N7=Bn),Min,IF((N7*Month)-R7-T7=Bo+Bn,Habis,IF(AND(((N7*Month)-R7-T7)>Month,R7=0),ROUNDDOWN(((N7*Month)-R7-T7)/Month,No)&Tahun&Min_&((N7*Month)-R7-T7)-(ROUNDDOWN(((N7*Month)-R7-T7)/Month,Np)*Month)&Bulan,IF(((N7*Month)-R7-T7)>Month,ROUNDDOWN(((N7*Month)-R7-T7)/Month,No)&Tahun&Min_&((N7*Month)-R7-T7)-(ROUNDDOWN(((N7*Month)-R7-T7)/Month,Np)*Month)&Bulan,(N7*Month)-R7-T7&Bulan))))","v":"-"}]
[null,{"$f":"IF(C8=No,Min,COUNTA(C$8:C8))","v":1},"Tanah Kantor","Tanah","1900-01-10","Januari",2015,"Januari",2015,null,75000000,75000000,null,0,{"$f":"IF(Nm<>Nn,Min,IF(Bl<>Bm,Min,IF(N8<>Bo,(1/N8)+Np,Min)))","v":"-"},{"$f":"IF(Nm<>Nn,No,IF(OR(Bl<>Bm),Bn,IF(O8=Min,No,((L8-M8-Np-Bo)*(O8/12)+Np+Bo))))","v":0},{"$f":"IF(AND(Nm=Nn,Bl=Bm),IF(H8<>Bn,IF(Bln<>Bo,IF(N8<>Bn,IF(AND(Thn=I8,VLOOKUP(Bln,ID,Scd,FALSE)>=VLOOKUP(H8,ID,Scd,FALSE)),P8,IF(AND(Thn>I8,(12-VLOOKUP(H8,ID,Scd,FALSE))+((Thn-I8)*12)-(12-VLOOKUP(Bln,ID,Scd,FALSE))<N8*12),P8,No)),Np),Bo),Bn),Bo)","v":0},{"$f":"IF(AND(Nm=Nn,Bl=Bm),IF(H8<>Bn,IF((IF(13-VLOOKUP(H8,ID,Scd,FALSE)+(Thn-I8-1)*12<=N8*12,13-Bn-VLOOKUP(H8,ID,Scd,FALSE)+Bo+(Thn-I8-1)*12,IF(AND(13-VLOOKUP(H8,ID,Scd,FALSE)+(Thn-I8-1)*12>N8*12),N8*12,Np)))<Bo,Bn,(IF(13-VLOOKUP(H8,ID,Scd,FALSE)+(Thn-I8-1)*12<=N8*12,13-VLOOKUP(H8,ID,Scd,FALSE)+(Thn-I8-1)*12,IF(13-VLOOKUP(H8,ID,Scd,FALSE)+(Thn-I8-1)*12>N8*12,N8*12,No)))),Np),Bn+Bo)","v":0},{"$f":"IF(P8=Min,No,P8*R8)","v":0},{"$f":"IF(ISNA(VLOOKUP(H8,ID,Scd,FALSE))=TRUE,No,IF(IF(N8*12=R8,Bn,IF(AND(N8*12-R8<VLOOKUP(H8,ID,Scd,FALSE),VLOOKUP(H8,ID,Scd,FALSE)<=VLOOKUP(Bln,ID,Scd,FALSE)),VLOOKUP(H8,ID,Scd,FALSE)-1,IF(AND(N8*12-R8<VLOOKUP(H8,ID,Scd,FALSE),VLOOKUP(H8,ID,Scd,FALSE)>VLOOKUP(Bln,ID,Scd,FALSE)),VLOOKUP(Bln,ID,Scd,FALSE),IF(AND(R8=Bo,I8<Thn),VLOOKUP(Bln,ID,Scd,FALSE)-1,IF(AND(R8=Bn,I8=Thn),VLOOKUP(Bln,ID,Scd,FALSE)-VLOOKUP(H8,ID,Scd,FALSE)+1,VLOOKUP(Bln,ID,Scd,FALSE))))))<Bo,Np+Bo,IF(OR(Thn<I8,H8=Bn,Bln=Bo,Nm<>Nn,Bl<>Bm),No+Bn,IF(N8*12=R8,Bn,IF(AND(N8*12-R8<VLOOKUP(H8,ID,Scd,FALSE),VLOOKUP(H8,ID,Scd,FALSE)<=VLOOKUP(Bln,ID,Scd,FALSE)),VLOOKUP(H8,ID,Scd,FALSE)-1,IF(AND(N8*12-R8<VLOOKUP(H8,ID,Scd,FALSE),VLOOKUP(H8,ID,Scd,FALSE)>VLOOKUP(Bln,ID,Scd,FALSE)),VLOOKUP(Bln,ID,Scd,FALSE),IF(AND(R8=Bo,I8<Thn),VLOOKUP(Bln,ID,Scd,FALSE)-1,IF(AND(R8=Bn,I8=Thn),VLOOKUP(Bln,ID,Scd,FALSE)-VLOOKUP(H8,ID,Scd,FALSE)+1,VLOOKUP(Bln,ID,Scd,FALSE)))))))))","v":0},{"$f":"P8*T8","v":0},{"$f":"S8+U8","v":0},{"$f":"L8-V8","v":75000000},"-"]
[null,{"$f":"IF(C9=No,Min,COUNTA(C$8:C9))","v":2},"Tanah Gudang I","Tanah","1900-01-15","Februari",2015,"Februari",2015,null,150000000,150000000,null,0,"-",0,0,0,0,0,0,0,150000000,"-"]
[null,{"$f":"IF(C10=No,Min,COUNTA(C$8:C10))","v":3},"Tanah Gudang II","Tanah","1900-01-20","Februari",2015,"Februari",2015,null,100000000,100000000,null,0,"-",0,0,0,0,0,0,0,100000000,"-"]
[null,{"$f":"IF(C11=No,Min,COUNTA(C$8:C11))","v":"-"},null,null,null,null,null,null,null,null,null,0,null,null,"-",0,0,0,0,0,0,0,0,"-"]
[null,{"$f":"IF(C12=No,Min,COUNTA(C$8:C12))","v":"-"},null,null,null,null,null,null,null,null,null,0,null,null,"-",0,0,0,0,0,0,0,0,"-"]
[null,{"$f":"IF(C13=No,Min,COUNTA(C$8:C13))","v":"-"},null,null,null,null,null,null,null,null,null,0,null,null,"-",0,0,0,0,0,0,0,0,"-"]
[null,null,"Sub Total",null,null,null,null,null,null,null,{"$f":"SUM(K8:K13)","v":325000000},{"$f":"SUM(L8:L13)","v":325000000},null,null,null,{"$f":"SUM(P8:P13)","v":0},{"$f":"SUM(Q8:Q13)","v":0},null,{"$f":"SUM(S8:S13)","v":0},null,{"$f":"SUM(U8:U13)","v":0},{"$f":"SUM(V8:V13)","v":0},{"$f":"SUM(W8:W13)","v":325000000},"-"]
[null,null,null,null,null,null,null,null,null,null,null,{"$f":"IF(Nm<>Nn,No,IF(Bl<>Bm,Bn,IF(J15<>Bn,J15*K15+Np,K15+Bo)))","v":0},null,null,{"$f":"IF(Nm<>Nn,Min,IF(Bl<>Bm,Min,IF(N15<>Bo,(1/N15)+Np,Min)))","v":"-"},{"$f":"IF(Nm<>Nn,No,IF(OR(Bl<>Bm),Bn,IF(O15=Min,No,((L15-M15-Np-Bo)*(O15/12)+Np+Bo))))","v":0},{"$f":"IF(AND(Nm=Nn,Bl=Bm),IF(H15<>Bn,IF(Bln<>Bo,IF(N15<>Bn,IF(AND(Thn=I15,VLOOKUP(Bln,ID,Scd,FALSE)>=VLOOKUP(H15,ID,Scd,FALSE)),P15,IF(AND(Thn>I15,(12-VLOOKUP(H15,ID,Scd,FALSE))+((Thn-I15)*12)-(12-VLOOKUP(Bln,ID,Scd,FALSE))<N15*12),P15,No)),Np),Bo),Bn),Bo)","v":0},{"$f":"IF(AND(Nm=Nn,Bl=Bm),IF(H15<>Bn,IF((IF(13-VLOOKUP(H15,ID,Scd,FALSE)+(Thn-I15-1)*12<=N15*12,13-Bn-VLOOKUP(H15,ID,Scd,FALSE)+Bo+(Thn-I15-1)*12,IF(AND(13-VLOOKUP(H15,ID,Scd,FALSE)+(Thn-I15-1)*12>N15*12),N15*12,Np)))<Bo,Bn,(IF(13-VLOOKUP(H15,ID,Scd,FALSE)+(Thn-I15-1)*12<=N15*12,13-VLOOKUP(H15,ID,Scd,FALSE)+(Thn-I15-1)*12,IF(13-VLOOKUP(H15,ID,Scd,FALSE)+(Thn-I15-1)*12>N15*12,N15*12,No)))),Np),Bn+Bo)","v":0},{"$f":"IF(P15=Min,No,P15*R15)","v":0},{"$f":"IF(ISNA(VLOOKUP(H15,ID,Scd,FALSE))=TRUE,No,IF(IF(N15*12=R15,Bn,IF(AND(N15*12-R15<VLOOKUP(H15,ID,Scd,FALSE),VLOOKUP(H15,ID,Scd,FALSE)<=VLOOKUP(Bln,ID,Scd,FALSE)),VLOOKUP(H15,ID,Scd,FALSE)-1,IF(AND(N15*12-R15<VLOOKUP(H15,ID,Scd,FALSE),VLOOKUP(H15,ID,Scd,FALSE)>VLOOKUP(Bln,ID,Scd,FALSE)),VLOOKUP(Bln,ID,Scd,FALSE),IF(AND(R15=Bo,I15<Thn),VLOOKUP(Bln,ID,Scd,FALSE)-1,IF(AND(R15=Bn,I15=Thn),VLOOKUP(Bln,ID,Scd,FALSE)-VLOOKUP(H15,ID,Scd,FALSE)+1,VLOOKUP(Bln,ID,Scd,FALSE))))))<Bo,Np+Bo,IF(OR(Thn<I15,H15=Bn,Bln=Bo,Nm<>Nn,Bl<>Bm),No+Bn,IF(N15*12=R15,Bn,IF(AND(N15*12-R15<VLOOKUP(H15,ID,Scd,FALSE),VLOOKUP(H15,ID,Scd,FALSE)<=VLOOKUP(Bln,ID,Scd,FALSE)),VLOOKUP(H15,ID,Scd,FALSE)-1,IF(AND(N15*12-R15<VLOOKUP(H15,ID,Scd,FALSE),VLOOKUP(H15,ID,Scd,FALSE)>VLOOKUP(Bln,ID,Scd,FALSE)),VLOOKUP(Bln,ID,Scd,FALSE),IF(AND(R15=Bo,I15<Thn),VLOOKUP(Bln,ID,Scd,FALSE)-1,IF(AND(R15=Bn,I15=Thn),VLOOKUP(Bln,ID,Scd,FALSE)-VLOOKUP(H15,ID,Scd,FALSE)+1,VLOOKUP(Bln,ID,Scd,FALSE)))))))))","v":0},{"$f":"P15*T15","v":0},{"$f":"S15+U15","v":0},{"$f":"L15-V15","v":0},"-"]
{"$rows_left_out":43}
{"sheet":"Ketentuan UU","index":5,"n_rows":102,"n_cols":4,"rows_kept":102,"cut":false,"hidden":false,"merged":[]}
[]
[null,"Penyusutan Kelompok Harta Berwujud"]
[]
[]
[]
[]
[]
[]
[]
[]
[]
[]
[]
[]
[]
{"$rows_left_out":88}
{"sheet":"HD","index":6,"n_rows":6000,"n_cols":649,"rows_kept":6000,"cut":false,"hidden":true,"merged":[]}
[]
[null,"info"]
[]
[]
[]
[]
[]
[]
[]
[]
[]
[]
[]
[]
[]
{"$rows_left_out":5985}